Mcreator nether poblem

3 posts / 0 new
Last post
Offline
Last seen: 3 months 3 weeks ago
Joined: 12/16/2015 - 19:27
Gems: 3
Mcreator nether poblem

error: cannot find symbol
        this.netherCaveGenerator.generate(this, this.worldObj, x, z, chunkprimer);
                                ^
  symbol:   method generate(ChunkProviderModded,World,int,int,ChunkPrimer)
  location: variable netherCaveGenerator of type MapGenBase
1 error
:compileJava FAILED
FAILURE: Build failed with an exception.
* What went wrong:
Execution faiTotal time: 12.348 secs
led for task ':compileJava'.
BUILD FAILED
> Compilation failed; see the compiler error outRun with --stacktrace option to get the stack trace. Run with --info or --debug option to get more log output.
put for details.

 

pls help

 



codyfilms's picture
Offline
Last seen: 3 weeks 3 days ago
Joined: 03/11/2015 - 05:16
Gems: 114
try recreating the element,

try recreating the element, if that dont work check the textures for blocks because sometimes they bug out and need to be refreshed

MCreator Moderator :)
commingle's picture
Offline
Last seen: 2 weeks 3 days ago
Joined: 05/04/2017 - 21:23
Gems: 29
my ores won't spawn in the

my ores won't spawn in the nether