Help me i have errors preventing me from exporting mods

2 posts / 0 new
Last post
Offline
Last seen: 1 year 5 months ago
Joined: 12/06/2015 - 17:54
Gems: 0
Help me i have errors preventing me from exporting mods

when ever i try to test or export my mod it comes up with this error meassge can someone tell me how to fix and what to do thank you

 

:clean
:downloadClient SKIPPED
:downloadServer SKIPPED
:getVersionJson
:extractUserDev
FAILURE: Build failed with an exception.
* What went wrong:
java.io.FileNotFoundException: C:\Users\Robert\Desktop\Mcreator\forge\.gradle\2.0\taskArtifacts\cache.properties (The system cannot find the file specified)
> C:\Users\Robert\Desktop\Mcreator\forge\.gradle\2.0\taskArtifacts\cache.properties (The system cannot find the file specified)
* Try:
Run with --stacktrace option to get the stack trace. Run with --info or --debug option to get more log output.
BUILD FAILED
Total time: 26.84 secs
C:\Users\Robert\Desktop\Mcreator\forge>
Task completed with return code 0 in 29887 milliseconds
Task return code check OK!



IuStrenght's picture
Offline
Last seen: 2 months 3 weeks ago
Joined: 08/19/2015 - 15:51
Gems: 109
Go to forge, gradle, 2.0

Go to forge, gradle, 2.0 and create a folder named taskArt