Exporting wont work it crashes.

1 post / 0 new
Offline
Last seen: 1 year 9 months ago
Joined: 11/05/2015 - 17:06
Gems: 0
Exporting wont work it crashes.

So basicly i try to export the mod and this happens... plz help

 

>BOOTING UP GRADLE...
>Data loaded, MCreator gradle console ready [ver 1.007]! [boot took 9 milliseconds]
>RIGHT click once to copy log to the clipboard or twice to clear the log.
>=========================================================================================================================
>Executing gradle command: build
>Microsoft Windows [Version 6.3.9600]
>(c) 2013 Microsoft Corporation. All rights reserved.
>C:\Pylo\MCreator159>cd forge
>C:\Pylo\MCreator159\forge>SET "JAVA_HOME=C:\Pylo\MCreator159\jdk\"
>C:\Pylo\MCreator159\forge>SET JAVA_EXE=%JAVA_HOME%\bin\java.exe
>C:\Pylo\MCreator159\forge>SET PATH=%JAVA_HOME%\bin\;%PATH%
>C:\Pylo\MCreator159\forge>gradlew build
>****************************
> Powered By MCP:             
> http://modcoderpack.com/    
> Searge, ProfMobius, Fesh0r, 
> R4wk, ZeuX, IngisKahn, bspkrs
> MCP Data version : unknown
>****************************
>:compileApiJava UP-TO-DATE
>:processApiResources UP-TO-DATE
>:apiClasses UP-TO-DATE
>:sourceMainJava
>=========================================================================================================================
>Executing gradle command: build
>Microsoft Windows [Version 6.3.9600]
>(c) 2013 Microsoft Corporation. All rights reserved.
>C:\Pylo\MCreator159>cd forge
>C:\Pylo\MCreator159\forge>SET "JAVA_HOME=C:\Pylo\MCreator159\jdk\"
>C:\Pylo\MCreator159\forge>SET JAVA_EXE=%JAVA_HOME%\bin\java.exe
>C:\Pylo\MCreator159\forge>SET PATH=%JAVA_HOME%\bin\;%PATH%
>C:\Pylo\MCreator159\forge>gradlew build
>C:\Pylo\MCreator159\forge\build\sources\java\mod\mcreator\mcreator_tester.java:123: error: cannot find symbol
>ModLoader.openGUI(entity, new GuiCrafting(entity.inventory, world, i, j, k)) ;
>^
>  symbol: variable ModLoader
>1 error
>:compileJava FAILED
>FAILURE: Build failed with an exception.
>* What went wrong:
>Execution failed for task ':compileJava'.
>> Compilation failed; see the compiler error output for details.
>BUILD FAILED
>* Try:
>Run with --stacktrace option to get the stack trace. Run with --info or --debug option to get more log output.
>Total time: 19.395 secs
>C:\Pylo\MCreator159\forge>