HELP!

1 post / 0 new
Offline
Last seen: 2 months 1 day ago
Joined: 03/12/2015 - 00:21
Gems: 4
HELP!

WHAT DO I DO?!?!

Code:

 

 

C:\Users\Elias Shalom\Desktop\MCreator 1.6.0 [1.8]\forge\build\sources\java\mod\mcreator\TestEnvironmentMod.java:170: error: ')' expected
if(wo
     ^
:compileJava FAILED
C:\Users\Elias Shalom\Desktop\MCreator 1.6.0 [1.8]\forge\build\sources\java\mod\mcreator\TestEnvironmentMod.java:171: error: not a statement
ld.provider.getDimensionId()==-1)mcreator_6.generateNether(world, random, chunkX, chunkZ);
                            ^
C:\Users\Elias Shalom\Desktop\MCreator 1.6.0 [1.8]\forge\build\sources\java\mod\mcreator\TestEnvironmentMod.java:171: error: ';' expected
ld.provider.getDimensionId()==-1)mcreator_6.generateNether(world, random, chunkX, chunkZ);
                                ^
3 errors
FAILURE: Build failed with an exception.
BUILD FAILED
* What went wrong:
Execution failed for task ':c> Compilation failed; see the compiler error output for details.
ompileJava'.
Total time: 10.057 secs
* Try:
Run with --stacktrace option to get the stack trace. Run with --info or --debug option to get more log output.
:sourceMainJava UP-TO-DATE
C:\Users\Elias Shalom\Desktop\MCreator 1.6.0 [1.8]\forge>
C:\Users\Elias Shalom\Desktop\MCreator 1.6.0 [1.8]\forge\build\sources\java\mod\mcreator\TestEnvironmentMod.java:170: error: ')' expected
if(wo
     ^
:compileJava FAILED
C:\Users\Elias Shalom\Desktop\MCreator 1.6.0 [1.8]\forge\build\sources\java\mod\mcreator\TestEnvironmentMod.java:171: error: not a statement
ld.provider.getDimensionId()==-1)mcreator_6.generateNether(world, random, chunkX, chunkZ);
                            ^
C:\Users\Elias Shalom\Desktop\MCreator 1.6.0 [1.8]\forge\build\sources\java\mod\mcreator\TestEnvironmentMod.java:171: error: ';' expected
ld.provider.getDimensionId()==-1)mcreator_6.generateNether(world, random, chunkX, chunkZ);
                                ^
3 errors
FAILURE: Build failed with an exception.
BUILD FAILED
* What went wrong:
Execution failed for task ':compileJava'.
> Compilation failed; see the compiler error output for detRun with --stacktrace option to get the stack trace. Run with --info or --debug option to get more log output.
ails.
* Try: