HELP!

5 posts / 0 new
Last post
Offline
Last seen: 3 months 1 day ago
Joined: 03/12/2015 - 00:21
Gems: 0
HELP!

Bug when i start my test for my better minecraft mod:

FAILURE: Build failed with an exception.
* What went wrong:
java.io.FileNotFoundException: C:\Users\Elias Shalom\Desktop\MCreator 1.6.0 [1.8]\forge\.gradle\2.0\taskArtifacts\cache.properties (The system cannot find the file specified)
> C:\Users\Elias Shalom\Desktop\MCreator 1.6.0 [1.8]\forge\.gradle\2.0\taskArtifacts\cache.properties (The system cannot find the file specified)
* Try:
BUILD FAILED
Run with --stacktrace option to get the stack trace. Run with --info or --debug option to get more log output.



Offline
Last seen: 1 year 2 months ago
Joined: 08/03/2015 - 17:55
Gems: 0
Have you deleted the cache

Have you deleted the cache.properties files?

It says that the file can not be found, so you may have to re-download MCreator 1.6.0

Or find the files and put them back (should be in your recycle bin) .

Offline
Last seen: 3 months 1 day ago
Joined: 03/12/2015 - 00:21
Gems: 0
i re-downloaded the zip but

i re-downloaded the zip but it still doesnt work!

Offline
Last seen: 4 months 3 weeks ago
Joined: 05/20/2015 - 18:41
Gems: 0
Go To
Offline
Last seen: 3 months 1 day ago
Joined: 03/12/2015 - 00:21
Gems: 0
nvm i fixed it, thanks a ton

nvm i fixed it, thanks a ton for ya help!