Nothing WORKS HELP!!!

2 posts / 0 new
Last post
Offline
Last seen: 1 year 8 months ago
Joined: 10/07/2015 - 21:53
Gems: 0
Nothing WORKS HELP!!!

When i try to start minecraft this happends:

 

>=========================================================================================================================
>Executing gradle command: runClient
>Microsoft Windows [Version 6.2.9200]
>(c) 2012 Microsoft Corporation. All rights reserved.
>C:\Users\tom\Desktop\Mod make i guess>cd forge
>C:\Users\tom\Desktop\Mod make i guess\forge>SET "JAVA_HOME=C:\Users\tom\Desktop\Mod make i guess\jdk\"
>C:\Users\tom\Desktop\Mod make i guess\forge>SET JAVA_EXE=%JAVA_HOME%\bin\java.exe
>C:\Users\tom\Desktop\Mod make i guess\forge>SET PATH=%JAVA_HOME%\bin\;%PATH%
>C:\Users\tom\Desktop\Mod make i guess\forge>gradlew runClient
>****************************
> Powered By MCP:             
> http://modcoderpack.com/    
> Searge, ProfMobius, Fesh0r, 
> R4wk, ZeuX, IngisKahn, bspkrs
> MCP Data version : unknown
>****************************
>:downloadClient SKIPPED
>:downloadServer SKIPPED
>:getVersionJson
>:extractUserDev
>FAILURE: Build failed with an exception.
>* What went wrong:
>java.io.FileNotFoundException: C:\Users\tom\Desktop\Mod make i guess\forge\.gradle\2.0\taskArtifacts\cache.properties (The system cannot find the file specified)
>> C:\Users\tom\Desktop\Mod make i guess\forge\.gradle\2.0\taskArtifacts\cache.properties (The system cannot find the file specified)
>* Try:
>BUILD FAILED
>Run with --stacktrace option to get the stack trace. Run with --info or --debug option to get more log output.
>Total time: 7.032 secs
>C:\Users\tom\Desktop\Mod make i guess\forge>
>Task completed with return code 0 in 7519 milliseconds
>Task return code check OK!

EDIT: ITS FIXED

Edited by: tommyb008 on 10/08/2015 - 02:47


Offline
Last seen: 1 year 8 months ago
Joined: 10/07/2015 - 21:53
Gems: 0
that happends when i try do

that happends when i try do EVERYTHING!!!! PLZ help!!!