It can't find it's built in Forge?

1 post / 0 new
Offline
Last seen: 1 year 3 months ago
Joined: 09/08/2015 - 00:10
Gems: 0
It can't find it's built in Forge?

===================================================================================================================================
Executing gradle command: clean build
Microsoft Windows [Version 6.1.7601]
Copyright (c) 2009 Microsoft Corporation.  All rights reserved.
C:\Pylo\MCreator158>cd forge
C:\Pylo\MCreator158\forge>SET "JAVA_HOME=C:\Pylo\MCreator158\jdk\"
C:\Pylo\MCreator158\forge>SET JAVA_EXE=%JAVA_HOME%\bin\java.exe
C:\Pylo\MCreator158\forge>SET PATH=%JAVA_HOME%\bin\;%PATH%
C:\Pylo\MCreator158\forge>SET "JAVA_OPTS=-Xmx400m -Xms200m"
C:\Pylo\MCreator158\forge>gradlew clean build
FAILURE: Build failed with an exception.
* What went wrong:
A problem occurred configuring root project 'forge'.
> Could not open buildscript class cache for build file 'C:\Pylo\MCreator158\forge\build.gradle' (C:\Users\Teresa\.gradle\caches\2.0\scripts\build_3o1nttsp2fijej5j0j3nn4o9sl\ProjectScript\buildscript).
   > java.io.FileNotFoundException: C:\Users\Teresa\.gradle\caches\2.0\scripts\build_3o1nttsp2fijej5j0j3nn4o9sl\ProjectScript\buildscript\cache.properties (The system cannot find the file specified)
* Try:
Run with --stacktrace option to get the stack trace. Run with --info or --debug option to get more log output.
BUILD FAILED
Total time: 1.581 secs
C:\Pylo\MCreator158\forge>
Task completed with return code 0 in 1753 milliseconds
Task return code check OK!