a quite random error.

4 posts / 0 new
Last post
jackj106's picture
Offline
Last seen: 3 months 3 weeks ago
Joined: 08/14/2015 - 20:11
Gems: 0
a quite random error.

i was going bout my day, adding in one thing, then i compiled it, and the WHOLE mod whent weird in the gradle log.:

BOOTING UP GRADLE...
Data loaded, MCreator gradle console ready [ver 1.007]! [boot took 8 milliseconds]
RIGHT click once to copy log to the clipboard or twice to clear the log.
===================================================================================================================================
Executing gradle command: clean build
Microsoft Windows [Version 6.3.9600]
(c) 2013 Microsoft Corporation. All rights reserved.
C:\Users\Jack\Downloads>cd forge
C:\Users\Jack\Downloads\forge>SET "JAVA_HOME=C:\Users\Jack\Downloads\jdk\"
C:\Users\Jack\Downloads\forge>SET JAVA_EXE=%JAVA_HOME%\bin\java.exe
C:\Users\Jack\Downloads\forge>SET PATH=%JAVA_HOME%\bin\;%PATH%
C:\Users\Jack\Downloads\forge>SET "JAVA_OPTS=-Xmx256m -Xms200m"
C:\Users\Jack\Downloads\forge>gradlew clean build
****************************
 Powered By MCP:             
 http://modcoderpack.com/    
 Searge, ProfMobius, Fesh0r,
 R4wk, ZeuX, IngisKahn, bspkrs
 MCP Data version : snapshot_20141130
****************************
:clean
:compileApiJava UP-TO-DATE
:processApiResources UP-TO-DATE
:apiClasses UP-TO-DATE
:sourceMainJava
C:\Users\Jack\Downloads\forge\build\sources\java\mod\mcreator\TestEnvironmentMod.java:115: error: cannot find symbol
mcreator_myPodGUI mcreator_9 = new mcreator_myPodGUI();
^
  symbol:   class mcreator_myPodGUI
  location: class TestEnvironmentMod
C:\Users\Jack\Downloads\forge\build\sources\java\mod\mcreator\TestEnvironmentMod.java:118: error: cannot find symbol
mcreator_cowre2 mcreator_12 = new mcreator_cowre2();
^
  symbol:   class mcreator_cowre2
  location: class TestEnvironmentMod
C:\Users\Jack\Downloads\forge\build\sources\java\mod\mcreator\TestEnvironmentMod.java:119: error: cannot find symbol
mcreator_cowre3 mcreator_13 = new mcreator_cowre3();
^
  symbol:   class mcreator_cowre3
  location: class TestEnvironmentMod
C:\Users\Jack\Downloads\forge\build\sources\java\mod\mcreator\TestEnvironmentMod.java:123: error: cannot find symbol
mcreator_jackj106 mcreator_17 = new mcreator_jackj106();
^
  symbol:   class mcreator_jackj106
  location: class TestEnvironmentMod
C:\Users\Jack\Downloads\forge\build\sources\java\mod\mcreator\TestEnvironmentMod.java:128: error: cannot find symbol
mcreator_iorngolem mcreator_22 = new mcreator_iorngolem();
^
  symbol:   class mcreator_iorngolem
  location: class TestEnvironmentMod
C:\Users\Jack\Downloads\forge\build\sources\java\mod\mcreator\TestEnvironmentMod.java:131: error: cannot find symbol
mcreator_indicator01 mcreator_25 = new mcreator_indicator01();
^
  symbol:   class mcreator_indicator01
  location: class TestEnvironmentMod
C:\Users\Jack\Downloads\forge\build\sources\java\mod\mcreator\TestEnvironmentMod.java:147: error: cannot find symbol
mcreator_packman mcreator_41 = new mcreator_packman();
^
  symbol:   class mcreator_packman
  location: class TestEnvironmentMod
C:\Users\Jack\Downloads\forge\build\sources\java\mod\mcreator\TestEnvironmentMod.java:148: error: cannot find symbol
mcreator_villager01 mcreator_42 = new mcreator_villager01();
^
  symbol:   class mcreator_villager01
  location: class TestEnvironmentMod
C:\Users\Jack\Downloads\forge\build\sources\java\mod\mcreator\TestEnvironmentMod.java:153: error: cannot find symbol
mcreator_wepon01 mcreator_47 = new mcreator_wepon01();
^
  symbol:   class mcreator_wepon01
  location: class TestEnvironmentMod
C:\Users\Jack\Downloads\forge\build\sources\java\mod\mcreator\TestEnvironmentMod.java:154: error: cannot find symbol
mcreator_wepon02 mcreator_48 = new mcreator_wepon02();
^
  symbol:   class mcreator_wepon02
  location: class TestEnvironmentMod
C:\Users\Jack\Downloads\forge\build\sources\java\mod\mcreator\TestEnvironmentMod.java:156: error: cannot find symbol
mcreator_wepon04 mcreator_50 = new mcreator_wepon04();
^
  symbol:   class mcreator_wepon04
  location: class TestEnvironmentMod
C:\Users\Jack\Downloads\forge\build\sources\java\mod\mcreator\TestEnvironmentMod.java:163: error: cannot find symbol
mcreator_itemfighters mcreator_57 = new mcreator_itemfighters();
^
  symbol:   class mcreator_itemfighters
  location: class TestEnvironmentMod
C:\Users\Jack\Downloads\forge\build\sources\java\mod\mcreator\TestEnvironmentMod.java:167: error: cannot find symbol
mcreator_grass mcreator_61 = new mcreator_grass();
^
  symbol:   class mcreator_grass
  location: class TestEnvironmentMod
C:\Users\Jack\Downloads\forge\build\sources\java\mod\mcreator\TestEnvironmentMod.java:186: error: cannot find symbol
mcreator_boots mcreator_80 = new mcreator_boots();
^
  symbol:   class mcreator_boots
  location: class TestEnvironmentMod
C:\Users\Jack\Downloads\forge\build\sources\java\mod\mcreator\TestEnvironmentMod.java:197: error: cannot find symbol
mcreator_ocelotblank mcreator_91 = new mcreator_ocelotblank();
^
  symbol:   class mcreator_ocelotblank
  location: class TestEnvironmentMod
C:\Users\Jack\Downloads\forge\build\sources\java\mod\mcreator\TestEnvironmentMod.java:198: error: cannot find symbol
mcreator_ocelot mcreator_92 = new mcreator_ocelot();
^
  symbol:   class mcreator_ocelot
  location: class TestEnvironmentMod
C:\Users\Jack\Downloads\forge\build\sources\java\mod\mcreator\TestEnvironmentMod.java:207: error: cannot find symbol
mcreator_nyanpig mcreator_101 = new mcreator_nyanpig();
^
  symbol:   class mcreator_nyanpig
  location: class TestEnvironmentMod
C:\Users\Jack\Downloads\forge\build\sources\java\mod\mcreator\TestEnvironmentMod.java:236: error: cannot find symbol
mcreator_pacre mcreator_130 = new mcreator_pacre();
^
  symbol:   class mcreator_pacre
  location: class TestEnvironmentMod
C:\Users\Jack\Downloads\forge\build\sources\java\mod\mcreator\TestEnvironmentMod.java:251: error: cannot find symbol
mcreator_link mcreator_145 = new mcreator_link();
^
  symbol:   class mcreator_link
  location: class TestEnvironmentMod
C:\Users\Jack\Downloads\forge\build\sources\java\mod\mcreator\TestEnvironmentMod.java:252: error: cannot find symbol
mcreator_sonic mcreator_146 = new mcreator_sonic();
^
  symbol:   class mcreator_sonic
  location: class TestEnvironmentMod
C:\Users\Jack\Downloads\forge\build\sources\java\mod\mcreator\TestEnvironmentMod.java:115: error: cannot find symbol
mcreator_myPodGUI mcreator_9 = new mcreator_myPodGUI();
                                   ^
  symbol:   class mcreator_myPodGUI
  location: class TestEnvironmentMod
C:\Users\Jack\Downloads\forge\build\sources\java\mod\mcreator\TestEnvironmentMod.java:118: error: cannot find symbol
mcreator_cowre2 mcreator_12 = new mcreator_cowre2();
                                  ^
  symbol:   class mcreator_cowre2
  location: class TestEnvironmentMod
C:\Users\Jack\Downloads\forge\build\sources\java\mod\mcreator\TestEnvironmentMod.java:119: error: cannot find symbol
mcreator_cowre3 mcreator_13 = new mcreator_cowre3();
                                  ^
  symbol:   class mcreator_cowre3
  location: class TestEnvironmentMod
C:\Users\Jack\Downloads\forge\build\sources\java\mod\mcreator\TestEnvironmentMod.java:123: error: cannot find symbol
mcreator_jackj106 mcreator_17 = new mcreator_jackj106();
                                    ^
  symbol:   class mcreator_jackj106
  location: class TestEnvironmentMod
C:\Users\Jack\Downloads\forge\build\sources\java\mod\mcreator\TestEnvironmentMod.java:128: error: cannot find symbol
mcreator_iorngolem mcreator_22 = new mcreator_iorngolem();
                                     ^
  symbol:   class mcreator_iorngolem
  location: class TestEnvironmentMod
C:\Users\Jack\Downloads\forge\build\sources\java\mod\mcreator\TestEnvironmentMod.java:131: error: cannot find symbol
mcreator_indicator01 mcreator_25 = new mcreator_indicator01();
                                       ^
  symbol:   class mcreator_indicator01
  location: class TestEnvironmentMod
C:\Users\Jack\Downloads\forge\build\sources\java\mod\mcreator\TestEnvironmentMod.java:147: error: cannot find symbol
mcreator_packman mcreator_41 = new mcreator_packman();
                                   ^
  symbol:   class mcreator_packman
  location: class TestEnvironmentMod
C:\Users\Jack\Downloads\forge\build\sources\java\mod\mcreator\TestEnvironmentMod.java:148: error: cannot find symbol
mcreator_villager01 mcreator_42 = new mcreator_villager01();
                                      ^
  symbol:   class mcreator_villager01
  location: class TestEnvironmentMod
C:\Users\Jack\Downloads\forge\build\sources\java\mod\mcreator\TestEnvironmentMod.java:153: error: cannot find symbol
mcreator_wepon01 mcreator_47 = new mcreator_wepon01();
                                   ^
  symbol:   class mcreator_wepon01
  location: class TestEnvironmentMod
C:\Users\Jack\Downloads\forge\build\sources\java\mod\mcreator\TestEnvironmentMod.java:154: error: cannot find symbol
mcreator_wepon02 mcreator_48 = new mcreator_wepon02();
                                   ^
  symbol:   class mcreator_wepon02
  location: class TestEnvironmentMod
C:\Users\Jack\Downloads\forge\build\sources\java\mod\mcreator\TestEnvironmentMod.java:156: error: cannot find symbol
mcreator_wepon04 mcreator_50 = new mcreator_wepon04();
                                   ^
  symbol:   class mcreator_wepon04
  location: class TestEnvironmentMod
C:\Users\Jack\Downloads\forge\build\sources\java\mod\mcreator\TestEnvironmentMod.java:163: error: cannot find symbol
mcreator_itemfighters mcreator_57 = new mcreator_itemfighters();
                                        ^
  symbol:   class mcreator_itemfighters
  location: class TestEnvironmentMod
C:\Users\Jack\Downloads\forge\build\sources\java\mod\mcreator\TestEnvironmentMod.java:167: error: cannot find symbol
mcreator_grass mcreator_61 = new mcreator_grass();
                                 ^
  symbol:   class mcreator_grass
  location: class TestEnvironmentMod
C:\Users\Jack\Downloads\forge\build\sources\java\mod\mcreator\TestEnvironmentMod.java:186: error: cannot find symbol
mcreator_boots mcreator_80 = new mcreator_boots();
                                 ^
  symbol:   class mcreator_boots
  location: class TestEnvironmentMod
C:\Users\Jack\Downloads\forge\build\sources\java\mod\mcreator\TestEnvironmentMod.java:197: error: cannot find symbol
mcreator_ocelotblank mcreator_91 = new mcreator_ocelotblank();
                                       ^
  symbol:   class mcreator_ocelotblank
  location: class TestEnvironmentMod
C:\Users\Jack\Downloads\forge\build\sources\java\mod\mcreator\TestEnvironmentMod.java:198: error: cannot find symbol
mcreator_ocelot mcreator_92 = new mcreator_ocelot();
                                  ^
  symbol:   class mcreator_ocelot
  location: class TestEnvironmentMod
C:\Users\Jack\Downloads\forge\build\sources\java\mod\mcreator\TestEnvironmentMod.java:207: error: cannot find symbol
mcreator_nyanpig mcreator_101 = new mcreator_nyanpig();
                                    ^
  symbol:   class mcreator_nyanpig
  location: class TestEnvironmentMod
C:\Users\Jack\Downloads\forge\build\sources\java\mod\mcreator\TestEnvironmentMod.java:236: error: cannot find symbol
mcreator_pacre mcreator_130 = new mcreator_pacre();
                                  ^
  symbol:   class mcreator_pacre
  location: class TestEnvironmentMod
C:\Users\Jack\Downloads\forge\build\sources\java\mod\mcreator\TestEnvironmentMod.java:251: error: cannot find symbol
mcreator_link mcreator_145 = new mcreator_link();
                                 ^
  symbol:   class mcreator_link
  location: class TestEnvironmentMod
C:\Users\Jack\Downloads\forge\build\sources\java\mod\mcreator\TestEnvironmentMod.java:252: error: cannot find symbol
mcreator_sonic mcreator_146 = new mcreator_sonic();
                                  ^
  symbol:   class mcreator_sonic
  location: class TestEnvironmentMod
C:\Users\Jack\Downloads\forge\build\sources\java\mod\mcreator\TestEnvironmentMod.java:1332: error: cannot find symbol
if(id == mcreator_myPodGUI.GUIID)return new mcreator_myPodGUI.GuiContainerMod(player);
         ^
  symbol:   variable mcreator_myPodGUI
  location: class GuiHandler
C:\Users\Jack\Downloads\forge\build\sources\java\mod\mcreator\TestEnvironmentMod.java:1332: error: package mcreator_myPodGUI does not exist
if(id == mcreator_myPodGUI.GUIID)return new mcreator_myPodGUI.GuiContainerMod(player);
                                                             ^
C:\Users\Jack\Downloads\forge\build\sources\java\mod\mcreator\TestEnvironmentMod.java:1335: error: cannot find symbol
if(id == mcreator_myPodGUI.GUIID)return new mcreator_myPodGUI.GuiWindow(world, x, y, z, player);
         ^
  symbol:   variable mcreator_myPodGUI
  location: class GuiHandler
C:\Users\Jack\Downloads\forge\build\sources\java\mod\mcreator\TestEnvironmentMod.java:1335: error: package mcreator_myPodGUI does not exist
if(id == mcreator_myPodGUI.GUIID)return new mcreator_myPodGUI.GuiWindow(world, x, y, z, player);
                                                             ^
C:\Users\Jack\Downloads\forge\build\sources\java\mod\mcreator\mcreator_mypod.java:153: error: cannot find symbol
if(entity instanceof EntityPlayer)((EntityPlayer)entity).openGui(instance, mcreator_myPodGUI.GUIID, world, i, j, k);
                                                                           ^
  symbol:   variable mcreator_myPodGUI
  location: class Itemmypod
C:\Users\Jack\Downloads\forge\build\sources\java\mod\mcreator\mcreator_mobitemdemention.java:1304: error: cannot find symbol
                                    p_147424_3_[j3 += short1] = mcreator_grass.block;
                                                                ^
  symbol:   variable mcreator_grass
  location: class ChunkProviderModded
C:\Users\Jack\Downloads\forge\build\sources\java\mod\mcreator\mcreator_mobitemdemention.java:1474: error: package mcreator_grass does not exist
                                    p_180518_3_.setBlockState(k * 4 + i3, k2 * 8 + l2, j1 * 4 + j3, mcreator_grass.block.getDefaultState());
                                                                                                                  ^
47 errors
:compileJava FAILED
FAILURE: Build failed with an exception.
* What went wrong:
Execution failed for task ':compileJava'.
> Compilation failed; see the compiler error output for details.
* Try:
BUILD FAILED
Run with --stacktrace option to get the stack trace. Run with --info or --debug option to get more log output.
Total time: 27.837 secs
C:\Users\Jack\Downloads\forge>
Task completed with return code 0 in 29200 milliseconds


the whole thing is acting weird, and idk what to do. i need a response NOW. im gonna see if deleting the new thing helps, but IDK.

 



Coolguy1260's picture
Offline
Last seen: 2 weeks 6 hours ago
Joined: 11/17/2014 - 00:15
Gems: 0
I dunno whats wrong but try

I dunno whats wrong but try reinstalling.

Coolguy1260's picture
Offline
Last seen: 2 weeks 6 hours ago
Joined: 11/17/2014 - 00:15
Gems: 0
you know mcreator is buggy

you know mcreator is buggy

jackj106's picture
Offline
Last seen: 3 months 3 weeks ago
Joined: 08/14/2015 - 20:11
Gems: 0
RE:you know mcreator is buggy

@Coolguy1260 kinda crazy, but if i just select the mods w/ errors, then edit, next next next next, and the one errors gone, but i have to do it with EVERY SINGLE ONE.