HELP!!!!!

4 posts / 0 new
Last post
Offline
Last seen: 1 year 5 months ago
Joined: 09/06/2015 - 00:05
Gems: 0
HELP!!!!!

BOOTING UP GRADLE...
Data loaded, MCreator gradle console ready [ver 1.007]! [boot took 5 milliseconds]
RIGHT click once to copy log to the clipboard or twice to clear the log.
===================================================================================================================================
Executing gradle command: cleanCache clean setupDecompWorkspace --refresh-dependencies
****************************
 Powered By MCP:             
 http://modcoderpack.com/    
 Searge, ProfMobius, Fesh0r, 
 R4wk, ZeuX, IngisKahn, bspkrs
 MCP Data version : snapshot_20141130
****************************
:cleanCache
:clean
:extractMcpData
:getVersionJson
:extractUserDev
:genSrgs
:extractNatives
:getAssetsIndex
:getAssets
Current status: 6/734   0%
Current status: 55/734   7%
Current status: 133/734   18%
Current status: 224/734   30%
Current status: 313/734   42%
Current status: 351/734   47%
Current status: 429/734   58%
Current status: 464/734   63%
Current status: 499/734   67%
Current status: 533/734   72%
Current status: 564/734   76%
Current status: 579/734   78%
Current status: 601/734   81%
Current status: 698/734   95%
Current status: 734/734   100%
:makeStart
:downloadMcpTools
:downloadClient
:downloadServer
:mergeJars
:deobfuscateJar
Applying SpecialSource...
Applying Exceptor...
:decompile
:processSources
Injecting fml files
Applying fml patches
Applying forge patches
:remapJar FAILED
FAILURE: Build failed with an exception.
* What went wrong:
Execution failed for task ':remapJar'.
BUILD FAILED
> Java heap space
Total time: 11 mins 14.647 secs
* Try:
Run with --stacktrace option to get the stack trace. Run with --info or --debug option to get more log output.
Task completed with return code 1 in 676529 milliseconds
===================================================================================================================================
Executing gradle command: clean runClient
sudo: no tty present and no askpass program specified
Task completed with return code 1 in 81 milliseconds

I don't can build



SwaggyPig's picture
Offline
Last seen: 2 weeks 2 days ago
Joined: 04/08/2015 - 19:50
Gems: 20
Somthing wrong with java    

Somthing wrong with java

 

 

Offline
Last seen: 1 year 4 months ago
Joined: 09/06/2015 - 10:43
Gems: 0
sam but i cant get past

sam but i cant get past Applying Exceptor

Offline
Last seen: 1 year 3 weeks ago
Joined: 01/14/2015 - 01:24
Gems: 0
It works for me, but when you

It works for me, but when you try to load it, is there a popup with one of the options being "Show gradle log"? If so, click that and copy-paste that into this thread. That could give some more information about your problem.

I am most likely not equipped to handle this problem, but it would be easier for somebody who is equipped to handle it if they had a little more information.