Advanced Enjineering

4 posts / 0 new
Last post
Offline
Last seen: 1 year 7 months ago
Joined: 07/28/2015 - 23:49
Gems: 0
Advanced Enjineering

**Sorry I may have posted this in two spots, still getting used to the website :D**

I Have Decided to Take On a New Project!
Mods.
I will be using MCreator as I have knowlage about codeing.
This mod will be all about Ores, Processessing and More.
For my first part, I will be adding Ores (Rates May Be Changed)
I will also add many items that at the moment, will not be able to get in Survival. I will future add them.
PS. If you are intrested, give it a diamond. If you would like to help, I only want one helper
1st Update Coming Soon!
*Item Spawn Rates and things will be Tweaks and are subject to change!*



Offline
Last seen: 1 year 7 months ago
Joined: 07/28/2015 - 23:49
Gems: 0
Having Problems!

Having Problems!

Executing gradle command: clean runClient
Microsoft Windows [Version 6.3.9600]
(c) 2013 Microsoft Corporation. All rights reserved.
C:\Pylo\MCreator158>cd forge
C:\Pylo\MCreator158\forge>SET "JAVA_HOME=C:\Pylo\MCreator158\jdk\"
C:\Pylo\MCreator158\forge>SET JAVA_EXE=%JAVA_HOME%\bin\java.exe
C:\Pylo\MCreator158\forge>SET PATH=%JAVA_HOME%\bin\;%PATH%
C:\Pylo\MCreator158\forge>SET "JAVA_OPTS=-Xmx256m -Xms200m"
C:\Pylo\MCreator158\forge>gradlew clean runClient
****************************
 Powered By MCP:             
 http://modcoderpack.com/    
 Searge, ProfMobius, Fesh0r,
 R4wk, ZeuX, IngisKahn, bspkrs
 MCP Data version : snapshot_20141130
****************************
:clean
:downloadClient SKIPPED
:downloadServer SKIPPED
:getVersionJson
:extractUserDev
FAILURE: Build failed with an exception.
* What went wrong:
java.io.FileNotFoundException: C:\Pylo\MCreator158\forge\.gradle\2.0\taskArtifacts\cache.properties (The system cannot find the file specified)
> C:\Pylo\MCreator158\forge\.gradle\2.0\taskArtifacts\cache.properties (The system cannot find the file specified)
* Try:
Run with --stacktrace option to get the stack trace. Run with --info or --debug option to get more log output.
BUILD FAILED
Total time: 22.704 secs
C:\Pylo\MCreator158\forge>
Task completed with return code 0 in 24579 milliseconds
Task return code check OK!

Please Help!

Offline
Last seen: 1 week 6 days ago
Joined: 12/21/2014 - 01:34
Gems: 0
Try reinstalling MCreator,

Try reinstalling MCreator, something like that happened to me before and reinstalling helped.

Offline
Last seen: 1 year 7 months ago
Joined: 07/28/2015 - 23:49
Gems: 0
that worked thx

that worked thx