BUG..... Can't read my mod...

1 post / 0 new
The Unknown 919's picture
Offline
Last seen: 1 year 4 months ago
Joined: 08/19/2015 - 06:23
Gems: 0
BUG..... Can't read my mod...

>C:\Pylo\MCreator156\forge\build\sources\java\mod\mcreator\TestEnvironmentMod.java:108: error: cannot find symbol
>    mcreator_futureLand mcreator_0 = new mcreator_futureLand();
>    ^
>  symbol:   class mcreator_futureLand
>  location: class TestEnvironmentMod
>C:\Pylo\MCreator156\forge\build\sources\java\mod\mcreator\TestEnvironmentMod.java:109: error: cannot find symbol
>mcreator_tomatoes mcreator_1 = new mcreator_tomatoes();
>^
>  symbol:   class mcreator_tomatoes
>  location: class TestEnvironmentMod
>C:\Pylo\MCreator156\forge\build\sources\java\mod\mcreator\TestEnvironmentMod.java:115: error: cannot find symbol
>mcreator_tNTwatch mcreator_7 = new mcreator_tNTwatch();
>^
>  symbol:   class mcreator_tNTwatch
>  location: class TestEnvironmentMod
>C:\Pylo\MCreator156\forge\build\sources\java\mod\mcreator\TestEnvironmentMod.java:108: error: cannot find symbol
>    mcreator_futureLand mcreator_0 = new mcreator_futureLand();
>                                         ^
>  symbol:   class mcreator_futureLand
>  location: class TestEnvironmentMod
>C:\Pylo\MCreator156\forge\build\sources\java\mod\mcreator\TestEnvironmentMod.java:109: error: cannot find symbol
>mcreator_tomatoes mcreator_1 = new mcreator_tomatoes();
>                                   ^
>  symbol:   class mcreator_tomatoes
>  location: class TestEnvironmentMod
>C:\Pylo\MCreator156\forge\build\sources\java\mod\mcreator\TestEnvironmentMod.java:115: error: cannot find symbol
>mcreator_tNTwatch mcreator_7 = new mcreator_tNTwatch();
>                                   ^
>  symbol:   class mcreator_tNTwatch
>  location: class TestEnvironmentMod
>6 errors
>:compileJava FAILED
>FAILURE: Build failed with an exception.
>* What went wrong:
>Execution failed for task ':compileJava'.
>> Compilation failed; see the compiler error output for details.
>* Try:
>Run with --stacktrace option to get the stack trace. Run with --info or --debug option to get more log output.
>BUILD FAILED
>Total time: 30.656 secs
>C:\Pylo\MCreator156\forge>
>Task completed with return code 0 in 33188 milliseconds
>=========================================================================================================================
>Executing gradle command: build
>=========================================================================================>Executing gradle command: build
================================
>========================================================>Executing gradle command: build
=================================================================
>Microsoft Windows XP [版本 5.1.2600]
>(C) Copyright 1985-2001 Microsoft Corp.
>C:\Pylo\MCreator156>cd forge
>C:\Pylo\MCreator156\forge>SET "JAVA_HOME=C:\Pylo\MCreator156\jdk\"
>C:\Pylo\MCreator156\forge>SET JAVA_EXE=%JAVA_HOME%\bin\java.exe
>C:\Pylo\MCreator156\forge>SET PATH=%JAVA_HOME%\bin\;%PATH%
>C:\Pylo\MCreator156\forge>gradlew build
>Microsoft Windows XP [版本 5.1.2600]
>(C) Copyright 1985-2001 Microsoft Corp.
>C:\Pylo\MCreator156>cd forge
>C:\Pylo\MCreator156\forge>SET "JAVA_HOME=C:\Pylo\MCreator156\jdk\"
>Microsoft Windows XP [版本 5.1.2600]
>(C) Copyright 1985-2001 Microsoft Corp.
>C:\Pylo\MCreator156>cd forge
>C:\Pylo\MCreator156\forge>SET JAVA_EXE=%JAVA_HOME%\bin\java.exe
>C:\Pylo\MCreator156\forge>SET PATH=%JAVA_HOME%\bin\;%PATH%
>C:\Pylo\MCreator156\forge>SET "JAVA_HOME=C:\Pylo\MCreator156\jdk\"
>C:\Pylo\MCreator156\forge>gradlew build
>C:\Pylo\MCreator156\forge>SET JAVA_EXE=%JAVA_HOME%\bin\java.exe
>C:\Pylo\MCreator156\forge>SET PATH=%JAVA_HOME%\bin\;%PATH%
>C:\Pylo\MCreator156\forge>gradlew build
>****************************
> Powered By MCP:             
> http://modcoderpack.com/    
> Searge, ProfMobius, Fesh0r,
> R4wk, ZeuX, IngisKahn, bspkrs
> MCP Data version : unknown
>****************************
>:compileApiJava UP-TO-DATE
>:processApiResources UP-TO-DATE
>:apiClasses UP-TO-DATE
>:sourceMainJava
>****************************
> Powered By MCP:             
> http://modcoderpack.com/    
> Searge, ProfMobius, Fesh0r,
> R4wk, ZeuX, IngisKahn, bspkrs
> MCP Data version : unknown
>****************************
>:compileApiJava UP-TO-DATE
>:processApiResources UP-TO-DATE
>:apiClasses UP-TO-DATE
>:sourceMainJava UP-TO-DATE
>****************************
> Powered By MCP:             
> http://modcoderpack.com/    
> Searge, ProfMobius, Fesh0r,
> R4wk, ZeuX, IngisKahn, bspkrs
> MCP Data version : unknown
>****************************
>:compileApiJava UP-TO-DATE
>:processApiResources UP-TO-DATE
>:apiClasses UP-TO-DATE
>:sourceMainJava UP-TO-DATE
>C:\Pylo\MCreator156\forge\build\sources\java\mod\mcreator\ClientProxyTestEnvironmentMod.java:3: error: class, interface, or enum expected
>package mod.mcreator;//based on master condiguration
>^
>C:\Pylo\MCreator156\forge\build\sources\java\mod\mcreator\ClientProxyTestEnvironmentMod.java:5: error: class, interface, or enum expected
>package mod.mcreator;//based on master condiguration
>^
>C:\Pylo\MCreator156\forge\build\sources\java\mod\mcreator\CommonProxyTestEnvironmentMod.java:3: error: class, interface, or enum expected
>package mod.mcreator;//based on master condiguration
>^
>C:\Pylo\MCreator156\forge\build\sources\java\mod\mcreator\CommonProxyTestEnvironmentMod.java:5: error: class, interface, or enum expected
>package mod.mcreator;//based on master condiguration
>^
>C:\Pylo\MCreator156\forge\build\sources\java\mod\mcreator\IPacketTestEnvironmentMod.java:3: error: class, interface, or enum expected
>package mod.mcreator;//based on master condiguration
>^
>C:\Pylo\MCreator156\forge\build\sources\java\mod\mcreator\IPacketTestEnvironmentMod.java:5: error: class, interface, or enum expected
>package mod.mcreator;//based on master condiguration
>^
>C:\Pylo\MCreator156\forge\build\sources\java\mod\mcreator\mcreator_GlobalEventsTestEnvironmentMod.java:3: error: class, interface, or enum expected
>package mod.mcreator;//based on master condiguration
>^
>7 errors
>:compileJava FAILED
>FAILURE: Build failed with an exception.
>* What went wrong:
>Execution failed for task ':compileJava'.
>> Compilation failed; see the compiler error output for details.
>BUILD F>Run with --stacktrace option to get the stack trace. Run with --info or --debug option to get more log output.
AILED
>* Try:
>Total time: 13.063 secs
>C:\Pylo\MCreator156\forge>
>C:\Pylo\MCreator156\forge\build\sources\java\mod\mcreator\ClientProxyTestEnvironmentMod.java:3: error: class, interface, or enum expected
>package mod.mcreator;//based on master condiguration
>^
>C:\Pylo\MCreator156\forge\build\sources\java\mod\mcreator\ClientProxyTestEnvironmentMod.java:5: error: class, interface, or enum expected
>package mod.mcreator;//based on master condiguration
>^
>C:\Pylo\MCreator156\forge\build\sources\java\mod\mcreator\CommonProxyTestEnvironmentMod.java:3: error: class, interface, or enum expected
>package mod.mcreator;//based on master condiguration
>^
>C:\Pylo\MCreator156\forge\build\sources\java\mod\mcreator\CommonProxyTestEnvironmentMod.java:5: error: class, interface, or enum expected
>package mod.mcreator;//based on master condiguration
>^
>C:\Pylo\MCreator156\forge\build\sources\java\mod\mcreator\IPacketTestEnvironmentMod.java:3: error: class, interface, or enum expected
>package mod.mcreator;//based on master condiguration
>^
>C:\Pylo\MCreator156\forge\build\sources\java\mod\mcreator\IPacketTestEnvironmentMod.java:5: error: class, interface, or enum expected
>package mod.mcreator;//based on master condiguration
>^
>C:\Pylo\MCreator156\forge\build\sources\java\mod\mcreator\mcreator_GlobalEventsTestEnvironmentMod.java:3: error: class, interface, or enum expected
>package mod.mcreator;//based on master condiguration
>^
>7 errors
>:compileJava FAILED
>FAILURE: Build failed with an exception.
>* What went wrong:
>Execution failed for task ':compileJava'.
>> Compilation failed; see the compiler error output for details.
>* Try:
>Run with --st>Total time: 14.11 secs
acktrace option to get the stack trace. Run with --info or --debug option to get more log output.
>BUILD FAILED
>C:\Pylo\MCreator156\forge>
>C:\Pylo\MCreator156\forge\build\sources\java\mod\mcreator\ClientProxyTestEnvironmentMod.java:3: error: class, interface, or enum expected
>package mod.mcreator;//based on master condiguration
>^
>C:\Pylo\MCreator156\forge\build\sources\java\mod\mcreator\ClientProxyTestEnvironmentMod.java:5: error: class, interface, or enum expected
>package mod.mcreator;//based on master condiguration
>^
>C:\Pylo\MCreator156\forge\build\sources\java\mod\mcreator\CommonProxyTestEnvironmentMod.java:3: error: class, interface, or enum expected
>package mod.mcreator;//based on master condiguration
>^
>C:\Pylo\MCreator156\forge\build\sources\java\mod\mcreator\CommonProxyTestEnvironmentMod.java:5: error: class, interface, or enum expected
>package mod.mcreator;//based on master condiguration
>^
>C:\Pylo\MCreator156\forge\build\sources\java\mod\mcreator\IPacketTestEnvironmentMod.java:3: error: class, interface, or enum expected
>package mod.mcreator;//based on master condiguration
>^
>C:\Pylo\MCreator156\forge\build\sources\java\mod\mcreator\IPacketTestEnvironmentMod.java:5: error: class, interface, or enum expected
>package mod.mcreator;//based on master condiguration
>^
>C:\Pylo\MCreator156\forge\build\sources\java\mod\mcreator\mcreator_GlobalEventsTestEnvironmentMod.java:3: error: class, interface, or enum expected
>package mod.mcreator;//based on master condiguration
>^
>7 errors
>:compileJava FAILED
>FAILURE: Build failed with an exception.
>* What went wrong:
>Execution failed for task ':compileJava'.
>BUILD FAILED
>> Compilation failed; see the compiler error output for details.
>Total time: 15.407 secs
>* Try:
>Run with --stacktrace option to get the stack trace. Run with --info or --debug option to get more log output.
>C:\Pylo\MCreator156\forge>
>Task completed with return code 0 in 16125 milliseconds
>=========================================================================================================================
>Executing gradle command: build
>Microsoft Windows XP [版本 5.1.2600]
>(C) Copyright 1985-2001 Microsoft Corp.
>C:\Pylo\MCreator156>cd forge
>C:\Pylo\MCreator156\forge>SET "JAVA_HOME=C:\Pylo\MCreator156\jdk\"
>C:\Pylo\MCreator156\forge>SET JAVA_EXE=%JAVA_HOME%\bin\java.exe
>C:\Pylo\MCreator156\forge>SET PATH=%JAVA_HOME%\bin\;%PATH%
>C:\Pylo\MCreator156\forge>gradlew build
>****************************
> Powered By MCP:             
> http://modcoderpack.com/    
> Searge, ProfMobius, Fesh0r,
> R4wk, ZeuX, IngisKahn, bspkrs
> MCP Data version : unknown
>****************************
>:compileApiJava UP-TO-DATE
>:processApiResources UP-TO-DATE
>:apiClasses UP-TO-DATE
>:sourceMainJava
>C:\Pylo\MCreator156\forge\build\sources\java\mod\mcreator\ClientProxyTestEnvironmentMod.java:3: error: class, interface, or enum expected
>package mod.mcreator;//based on master condiguration
>^
>C:\Pylo\MCreator156\forge\build\sources\java\mod\mcreator\ClientProxyTestEnvironmentMod.java:5: error: class, interface, or enum expected
>package mod.mcreator;//based on master condiguration
>^
>C:\Pylo\MCreator156\forge\build\sources\java\mod\mcreator\CommonProxyTestEnvironmentMod.java:3: error: class, interface, or enum expected
>package mod.mcreator;//based on master condiguration
>^
>C:\Pylo\MCreator156\forge\build\sources\java\mod\mcreator\CommonProxyTestEnvironmentMod.java:5: error: class, interface, or enum expected
>package mod.mcreator;//based on master condiguration
>^
>C:\Pylo\MCreator156\forge\build\sources\java\mod\mcreator\IPacketTestEnvironmentMod.java:3: error: class, interface, or enum expected
>package mod.mcreator;//based on master condiguration
>^
>C:\Pylo\MCreator156\forge\build\sources\java\mod\mcreator\IPacketTestEnvironmentMod.java:5: error: class, interface, or enum expected
>package mod.mcreator;//based on master condiguration
>^
>C:\Pylo\MCreator156\forge\build\sources\java\mod\mcreator\mcreator_GlobalEventsTestEnvironmentMod.java:3: error: class, interface, or enum expected
>package mod.mcreator;//based on master condiguration
>^
>7 errors
>:compileJava FAILED
>FAILURE: Build failed with an exception.
>* What went wrong:
>Execution failed for task ':compileJava'.
>> Compilation failed; see the compiler error output for details.
>* Try:
>Run with --stacktrace option to get the stack trace. Run with --info or --debug option to get more log output.
>BUILD FAILED
>Total time: 10.328 secs
>C:\Pylo\MCreator156\forge>
>Task completed with return code 0 in 11016 milliseconds
>=========================================================================================================================
>Executing gradle command: build
>Microsoft Windows XP [版本 5.1.2600]
>(C) Copyright 1985-2001 Microsoft Corp.
>C:\Pylo\MCreator156>cd forge
>C:\Pylo\MCreator156\forge>SET "JAVA_HOME=C:\Pylo\MCreator156\jdk\"
>C:\Pylo\MCreator156\forge>SET JAVA_EXE=%JAVA_HOME%\bin\java.exe
>C:\Pylo\MCreator156\forge>SET PATH=%JAVA_HOME%\bin\;%PATH%
>C:\Pylo\MCreator156\forge>gradlew build
>****************************
> Powered By MCP:             
> http://modcoderpack.com/    
> Searge, ProfMobius, Fesh0r,
> R4wk, ZeuX, IngisKahn, bspkrs
> MCP Data version : unknown
>****************************
>:compileApiJava UP-TO-DATE
>:processApiResources UP-TO-DATE
>:apiClasses UP-TO-DATE
>:sourceMainJava
>:compileJava
>:processResources
>:classes
>:jar
>:compileTestJava UP-TO-DATE
>:processTestResources UP-TO-DATE
>:testClasses UP-TO-DATE
>:test UP-TO-DATE
>:extractMcpData UP-TO-DATE
>:getVersionJson
>:extractUserDev UP-TO-DATE
>:genSrgs SKIPPED
>:reobf FAILED
>FAILURE: Build failed with an exception.
>* What went wrong:
>Execution failed for task ':reobf'.
>> MALFORMED
>BUILD FAILED
>Total time: 20.328 secs
>* Try:
>Run with --stacktrace option to get the stack trace. Run with --info or --debug option to get more log output.
>C:\Pylo\MCreator156\forge>
>Task completed with return code 0 in 21000 milliseconds
>Task return code check OK!
>=========================================================================================================================
>Executing gradle command: build
>Microsoft Windows XP [版本 5.1.2600]
>(C) Copyright 1985-2001 Microsoft Corp.
>C:\Pylo\MCreator156>cd forge
>C:\Pylo\MCreator156\forge>SET "JAVA_HOME=C:\Pylo\MCreator156\jdk\"
>C:\Pylo\MCreator156\forge>SET JAVA_EXE=%JAVA_HOME%\bin\java.exe
>C:\Pylo\MCreator156\forge>SET PATH=%JAVA_HOME%\bin\;%PATH%
>C:\Pylo\MCreator156\forge>gradlew build
>****************************
> Powered By MCP:             
> http://modcoderpack.com/    
> Searge, ProfMobius, Fesh0r,
> R4wk, ZeuX, IngisKahn, bspkrs
> MCP Data version : unknown
>****************************
>:compileApiJava UP-TO-DATE
>:processApiResources UP-TO-DATE
>:apiClasses UP-TO-DATE
>:sourceMainJava
>:compileJava
>:processResources
>:classes
>:jar
>:compileTestJava UP-TO-DATE
>:processTestResources UP-TO-DATE
>:testClasses UP-TO-DATE
>:test UP-TO-DATE
>:extractMcpData UP-TO-DATE
>:getVersionJson
>:extractUserDev UP-TO-DATE
>:genSrgs SKIPPED
>:reobf FAILED
>FAILURE: Build failed with an exception.
>* What went wrong:
>Execution failed for task ':reobf'.
>> MALFORMED
>* Try:
>Run with --stacktrace option to get the stack trace. Run with --info or --debug option to get more log output.
>BUILD FAILED
>Total time: 16.329 secs
>C:\Pylo\MCreator156\forge>
>Task completed with return code 0 in 17015 milliseconds
>Task return code check OK!
>=========================================================================================================================
>Executing gradle command: build
>Microsoft Windows XP [版本 5.1.2600]
>(C) Copyright 1985-2001 Microsoft Corp.
>C:\Pylo\MCreator156>cd forge
>C:\Pylo\MCreator156\forge>SET "JAVA_HOME=C:\Pylo\MCreator156\jdk\"
>C:\Pylo\MCreator156\forge>SET JAVA_EXE=%JAVA_HOME%\bin\java.exe
>C:\Pylo\MCreator156\forge>SET PATH=%JAVA_HOME%\bin\;%PATH%
>C:\Pylo\MCreator156\forge>gradlew build
>****************************
> Powered By MCP:             
> http://modcoderpack.com/    
> Searge, ProfMobius, Fesh0r,
> R4wk, ZeuX, IngisKahn, bspkrs
> MCP Data version : unknown
>****************************
>:compileApiJava UP-TO-DATE
>:processApiResources UP-TO-DATE
>:apiClasses UP-TO-DATE
>:sourceMainJava
>:compileJava
>:processResources UP-TO-DATE
>:classes
>:jar
>:compileTestJava UP-TO-DATE
>:processTestResources UP-TO-DATE
>:testClasses UP-TO-DATE
>:test UP-TO-DATE
>:extractMcpData UP-TO-DATE
>:getVersionJson
>:extractUserDev UP-TO-DATE
>:genSrgs SKIPPED
>:reobf FAILED
>FAILURE: Build failed with an exception.
>* What went wrong:
>Execution failed for task ':reobf'.
>> MALFORMED
>* Try:
>Run with --stacktrace option to get the stack trace. Run with --info or --debug option to get more log output.
>BUILD FAILED
>Total time: 14.266 secs
>C:\Pylo\MCreator156\forge>
>Task completed with return code 0 in 14953 milliseconds
>Task return code check OK!
>=========================================================================================================================
>Executing gradle command: build
>Microsoft Windows XP [版本 5.1.2600]
>(C) Copyright 1985-2001 Microsoft Corp.
>C:\Pylo\MCreator156>cd forge
>C:\Pylo\MCreator156\forge>SET "JAVA_HOME=C:\Pylo\MCreator156\jdk\"
>C:\Pylo\MCreator156\forge>SET JAVA_EXE=%JAVA_HOME%\bin\java.exe
>C:\Pylo\MCreator156\forge>SET PATH=%JAVA_HOME%\bin\;%PATH%
>C:\Pylo\MCreator156\forge>gradlew build
>****************************
> Powered By MCP:             
> http://modcoderpack.com/    
> Searge, ProfMobius, Fesh0r,
> R4wk, ZeuX, IngisKahn, bspkrs
> MCP Data version : unknown
>****************************
>:compileApiJava UP-TO-DATE
>:processApiResources UP-TO-DATE
>:apiClasses UP-TO-DATE
>:sourceMainJava
>C:\Pylo\MCreator156\forge\build\sources\java\mod\mcreator\mcreator_bioSword.java:128: error: illegal start of expression
>EntityArrow entityarrow = new EntityArrow(world, (EntityLivingBase)entity,  * 2.0F);
>                                                                            ^
>C:\Pylo\MCreator156\forge\build\sources\java\mod\mcreator\mcreator_bioSword.java:129: error: illegal start of expression
>entityarrow.setDamage(*2.0F);
>                      ^
>C:\Pylo\MCreator156\forge\build\sources\java\mod\mcreator\mcreator_bioSword.java:131: error: illegal start of expression
>world.playSoundAtEntity(entity, "random.bow", 1.0F, 1.0F / (0.5F * 0.4F + 1.2F) +  * 0.5F);
>                                                                                   ^
>3 errors
>:compileJava FAILED
>FAILURE: Build failed with an exception.
>* What went wrong:
>Execution failed for task ':compileJava'.
>> Compilation failed; see the compiler error output for details.
>* Try:
>Run with --stacktrace option to get the stack trace. Run with --info or --debug option to get more log output.
>BUILD FAILED
>Total time: 12.719 secs
>C:\Pylo\MCreator156\forge>
>Task completed with return code 0 in 13391 milliseconds
>=========================================================================================================================
>Executing gradle command: build
>Microsoft Windows XP [版本 5.1.2600]
>(C) Copyright 1985-2001 Microsoft Corp.
>C:\Pylo\MCreator156>cd forge
>C:\Pylo\MCreator156\forge>SET "JAVA_HOME=C:\Pylo\MCreator156\jdk\"
>C:\Pylo\MCreator156\forge>SET JAVA_EXE=%JAVA_HOME%\bin\java.exe
>C:\Pylo\MCreator156\forge>SET PATH=%JAVA_HOME%\bin\;%PATH%
>C:\Pylo\MCreator156\forge>gradlew build
>****************************
> Powered By MCP:             
> http://modcoderpack.com/    
> Searge, ProfMobius, Fesh0r,
> R4wk, ZeuX, IngisKahn, bspkrs
> MCP Data version : unknown
>****************************
>:compileApiJava UP-TO-DATE
>:processApiResources UP-TO-DATE
>:apiClasses UP-TO-DATE
>:sourceMainJava
>:compileJava
>:processResources UP-TO-DATE
>:classes
>:jar UP-TO-DATE
>:compileTestJava UP-TO-DATE
>:processTestResources UP-TO-DATE
>:testClasses UP-TO-DATE
>:test UP-TO-DATE
>:extractMcpData UP-TO-DATE
>:getVersionJson
>:extractUserDev UP-TO-DATE
>:genSrgs SKIPPED
>:reobf FAILED
>FAILURE: Build failed with an exception.
>* What went wrong:
>Execution failed for task ':reobf'.
>BUILD FAILED>* Try:

>> MA>Total t>Run with --stacktrace option to get the stack trace. Run with --info or --debug option to get more log output.
ime: 14.64 secs
LFORMED
>C:\Pylo\MCreator156\forge>
>Task completed with return code 0 in 15312 milliseconds
>Task return code check OK!


This is what happened did anyone else have the same bug? pls! SOS TheUnknown919