test run fail

1 post / 0 new
Offline
Last seen: 5 months 5 days ago
Joined: 07/29/2015 - 01:41
Gems: 0
test run fail

this is what it said

 

Microsoft Windows [Version 6.3.9600]
(c) 2013 Microsoft Corporation. All rights reserved.
C:\Pylo\MCreator157>cd forge
C:\Pylo\MCreator157\forge>SET "JAVA_HOME=C:\Pylo\MCreator157\jdk\"
C:\Pylo\MCreator157\forge>SET JAVA_EXE=%JAVA_HOME%\bin\java.exe
C:\Pylo\MCreator157\forge>SET PATH=%JAVA_HOME%\bin\;%PATH%
C:\Pylo\MCreator157\forge>gradlew clean build
****************************
 Powered By MCP:             
 http://modcoderpack.com/    
 Searge, ProfMobius, Fesh0r, 
 R4wk, ZeuX, IngisKahn, bspkrs
 MCP Data version : snapshot_20141130
****************************
:clean
:compileApiJava UP-TO-DATE
:processApiResources UP-TO-DATE
:apiClasses UP-TO-DATE
:sourceMainJava
C:\Pylo\MCreator157\forge\build\sources\java\mod\mcreator\mcreator_crowder.java:152: error: illegal start of expression
this.tasks.addTask(10, new EntityAITempt(this, 0.8D, , false));
                                                     ^
1 error
:compileJava FAILED
FAILURE: Build failed with an exception.
* What went wrong:
Execution failed for task ':compileJava'.
BUILD FAILED
> Compilation failed; see the compiler error output for details.
Total time: 5.16 secs
* Try:
Run with --stacktrace option to get the stack trace. Run with --info or --debug option to get more log output.
C:\Pylo\MCreator157\forge>
Task completed with return code 0 in 5731 milliseconds

 

 

please help ASAP