Test Environment

19 posts / 0 new
Last post
Offline
Last seen: 3 years 10 months ago
Joined: 03/09/2013 - 17:26
Gems: 0
Test Environment

When I click the play botton to test my mod it says, there has been a fatal error starting up minecraft and FML. If you know why or know how to fix it please comment or contact me. Thanks. I really need your help.

Edited by: catyxopcjex on 01/12/2013 - 23:05


Offline
Last seen: 3 years 7 months ago
Joined: 06/06/2013 - 22:08
Gems: 0
Same thing happend to me

Same thing happend to me please help!

Offline
Last seen: 3 years 5 months ago
Joined: 07/22/2013 - 02:19
Gems: 0
login.

Have you logged into mcreator from the program?IDK how to do that,Im trying to do it on a 80.7 gigabite of data.I belive you have to login into Mcreator to run it.Just an Idea.
P.S.You have to login in the program itself.

Offline
Last seen: 3 years 2 months ago
Joined: 11/06/2013 - 19:24
Gems: 0
RE:login.

I can't log in. It won't let me. Can you help me with this?

Offline
Last seen: 1 year 4 months ago
Joined: 08/23/2014 - 17:20
Gems: 0
Can you give me a copy of

Can you give me a copy of your log? I can maybe help.
Try looking at this webpage. You might have the same problem, and it was solved... by me.
If that does not work, copy and paste your log in the comments, and I will try to help you from there ;)

(For others having same problem, because this was a year ago.)

Offline
Last seen: 1 year 4 months ago
Joined: 08/23/2014 - 17:20
Gems: 0
RE:Can you give me a copy of

@_Blu Ops, webpage here: http://www.pylo.si/mcreator/forum/7556/exporting-wont-work

Offline
Last seen: 2 years 1 month ago
Joined: 08/23/2014 - 12:14
Gems: 0
---- Minecraft Crash Report -

---- Minecraft Crash Report ----
// Hey, that tickles! Hehehe!

Time: 8/30/14 7:05 AM
Description: There was a severe problem during mod loading that has caused the game to fail

cpw.mods.fml.common.LoaderException: java.lang.ClassNotFoundException: net.minecraft.src.ClientProxyTestEnvironmentMod
at cpw.mods.fml.common.ProxyInjector.inject(ProxyInjector.java:76)
at cpw.mods.fml.common.FMLModContainer.constructMod(FMLModContainer.java:492)
at sun.reflect.NativeMethodAccessorImpl.invoke0(Native Method)
at sun.reflect.NativeMethodAccessorImpl.invoke(Unknown Source)
at sun.reflect.DelegatingMethodAccessorImpl.invoke(Unknown Source)
at java.lang.reflect.Method.invoke(Unknown Source)
at com.google.common.eventbus.EventSubscriber.handleEvent(EventSubscriber.java:74)
at com.google.common.eventbus.SynchronizedEventSubscriber.handleEvent(SynchronizedEventSubscriber.java:47)
at com.google.common.eventbus.EventBus.dispatch(EventBus.java:322)
at com.google.common.eventbus.EventBus.dispatchQueuedEvents(EventBus.java:304)
at com.google.common.eventbus.EventBus.post(EventBus.java:275)
at cpw.mods.fml.common.LoadController.sendEventToModContainer(LoadController.java:208)
at cpw.mods.fml.common.LoadController.propogateStateMessage(LoadController.java:187)
at sun.reflect.NativeMethodAccessorImpl.invoke0(Native Method)
at sun.reflect.NativeMethodAccessorImpl.invoke(Unknown Source)
at sun.reflect.DelegatingMethodAccessorImpl.invoke(Unknown Source)
at java.lang.reflect.Method.invoke(Unknown Source)
at com.google.common.eventbus.EventSubscriber.handleEvent(EventSubscriber.java:74)
at com.google.common.eventbus.SynchronizedEventSubscriber.handleEvent(SynchronizedEventSubscriber.java:47)
at com.google.common.eventbus.EventBus.dispatch(EventBus.java:322)
at com.google.common.eventbus.EventBus.dispatchQueuedEvents(EventBus.java:304)
at com.google.common.eventbus.EventBus.post(EventBus.java:275)
at cpw.mods.fml.common.LoadController.distributeStateMessage(LoadController.java:118)
at cpw.mods.fml.common.Loader.loadMods(Loader.java:492)
at cpw.mods.fml.client.FMLClientHandler.beginMinecraftLoading(FMLClientHandler.java:204)
at net.minecraft.client.Minecraft.func_71384_a(Minecraft.java:480)
at net.minecraft.client.Minecraft.func_99999_d(Minecraft.java:867)
at net.minecraft.client.main.Main.main(SourceFile:148)
at sun.reflect.NativeMethodAccessorImpl.invoke0(Native Method)
at sun.reflect.NativeMethodAccessorImpl.invoke(Unknown Source)
at sun.reflect.DelegatingMethodAccessorImpl.invoke(Unknown Source)
at java.lang.reflect.Method.invoke(Unknown Source)
at net.minecraft.launchwrapper.Launch.launch(Launch.java:134)
at net.minecraft.launchwrapper.Launch.main(Launch.java:28)
Caused by: java.lang.ClassNotFoundException: net.minecraft.src.ClientProxyTestEnvironmentMod
at net.minecraft.launchwrapper.LaunchClassLoader.findClass(LaunchClassLoader.java:188)
at java.lang.ClassLoader.loadClass(Unknown Source)
at java.lang.ClassLoader.loadClass(Unknown Source)
at cpw.mods.fml.common.ModClassLoader.loadClass(ModClassLoader.java:58)
at java.lang.Class.forName0(Native Method)
at java.lang.Class.forName(Unknown Source)
at cpw.mods.fml.common.ProxyInjector.inject(ProxyInjector.java:59)
... 33 more
Caused by: java.lang.NullPointerException

A detailed walkthrough of the error, its code path and all known details is as follows:
---------------------------------------------------------------------------------------

-- System Details --
Details:
Minecraft Version: 1.7.10
Operating System: Windows 7 (amd64) version 6.1
Java Version: 1.7.0_40, Oracle Corporation
Java VM Version: Java HotSpot(TM) 64-Bit Server VM (mixed mode), Oracle Corporation
Memory: 39950776 bytes (38 MB) / 324534272 bytes (309 MB) up to 954728448 bytes (910 MB)
JVM Flags: 2 total; -XX:HeapDumpPath=MojangTricksIntelDriversForPerformance_javaw.exe_minecraft.exe.heapdump -Xmx1G
AABB Pool Size: 0 (0 bytes; 0 MB) allocated, 0 (0 bytes; 0 MB) used
IntCache: cache: 0, tcache: 0, allocated: 0, tallocated: 0
FML: MCP v9.05 FML v7.10.25.1199 Minecraft Forge 10.13.0.1199 4 mods loaded, 4 mods active
mcp{9.05} [Minecraft Coder Pack] (minecraft.jar) Unloaded->Constructed
FML{7.10.25.1199} [Forge Mod Loader] (forge-1.7.10-10.13.0.1199.jar) Unloaded->Constructed
Forge{10.13.0.1199} [Minecraft Forge] (forge-1.7.10-10.13.0.1199.jar) Unloaded->Constructed
TestEnvironmentMod{1.0} [TestEnvironmentMod] (Earth Life BETA Public Server 1.7.10.zip) Unloaded->Errored

Offline
Last seen: 9 months 2 weeks ago
Joined: 01/12/2015 - 02:23
Gems: 0
My Test Doesn't Work Either

My Test Doesn't Work Either

Offline
Last seen: 9 months 2 weeks ago
Joined: 01/12/2015 - 02:23
Gems: 0
Mine Said This

Mine Said This

>===================================================================================================================
>Executing gradle command: build
>****************************
> Powered By MCP:
> http://mcp.ocean-labs.de/
> Searge, ProfMobius, Fesh0r,
> R4wk, ZeuX, IngisKahn, bspkrs
> MCP Data version : unknown
>****************************
>:downloadClient SKIPPED
>:downloadServer SKIPPED
>:getVersionJson
>:extractUserDev UP-TO-DATE
>:mergeJars SKIPPED
>:applyBinPatches SKIPPED
>:downloadMcpTools SKIPPED
>:extractMcpData UP-TO-DATE
>:genSrgs SKIPPED
>:deobfBinJar
>Applying SpecialSource...
>:deobfBinJar FAILED
>FAILURE: Build failed with an exception.
>* What went wrong:
>Execution failed for task ':deobfBinJar'.
>> Java heap space
>BUILD FAILED
>* Try:
>Total time: 3 mins 37.204 secs
>Run with --stacktrace option to get the stack trace. Run with --info or --debug option to get more log output.
>Task completed with return code 1 in 217964 milliseconds

Offline
Last seen: 1 year 6 months ago
Joined: 01/13/2015 - 21:26
Gems: 0
Mine says this:

Mine says this:
>BOOTING UP GRADLE...
>Data loaded, MCreator gradle console ready [ver 1.007]! [boot took 22 milliseconds]
>RIGHT click once to copy log to the clipboard or twice to clear the log.
>===================================================================================================================
>Executing gradle command: runClient
>Microsoft Windows [Version 6.3.9600]
>(c) 2013 Microsoft Corporation. All rights reserved.
>C:\Pylo\MCreator154>cd forge
>C:\Pylo\MCreator154\forge>SET "JAVA_HOME=C:\Pylo\MCreator154\jdk\"
>C:\Pylo\MCreator154\forge>SET JAVA_EXE=%JAVA_HOME%\bin\java.exe
>C:\Pylo\MCreator154\forge>SET PATH=%JAVA_HOME%\bin\;%PATH%
>C:\Pylo\MCreator154\forge>gradlew runClient
>****************************
> Powered By MCP:
> http://mcp.ocean-labs.de/
> Searge, ProfMobius, Fesh0r,
> R4wk, ZeuX, IngisKahn, bspkrs
> MCP Data version : unknown
>****************************
>:compileApiJava UP-TO-DATE
>:processApiResources UP-TO-DATE
>:apiClasses UP-TO-DATE
>:sourceMainJava UP-TO-DATE
>C:\Pylo\MCreator154\forge\build\sources\java\mod\mcreator\TestEnvironmentMod.java:110: error: cannot find symbol
>mcreator_goldGrass mcreator_2 = new mcreator_goldGrass();
>^
> symbol: class mcreator_goldGrass
> location: class TestEnvironmentMod
>C:\Pylo\MCreator154\forge\build\sources\java\mod\mcreator\TestEnvironmentMod.java:111: error: cannot find symbol
>mcreator_diamondGrass mcreator_3 = new mcreator_diamondGrass();
>^
> symbol: class mcreator_diamondGrass
> location: class TestEnvironmentMod
>C:\Pylo\MCreator154\forge\build\sources\java\mod\mcreator\TestEnvironmentMod.java:112: error: cannot find symbol
>mcreator_ironIgnitor mcreator_4 = new mcreator_ironIgnitor();
>^
> symbol: class mcreator_ironIgnitor
> location: class TestEnvironmentMod
>C:\Pylo\MCreator154\forge\build\sources\java\mod\mcreator\TestEnvironmentMod.java:113: error: cannot find symbol
>mcreator_goldIgnitor mcreator_5 = new mcreator_goldIgnitor();
>^
> symbol: class mcreator_goldIgnitor
> location: class TestEnvironmentMod
>C:\Pylo\MCreator154\forge\build\sources\java\mod\mcreator\TestEnvironmentMod.java:114: error: cannot find symbol
>mcreator_diamondIgnitor mcreator_6 = new mcreator_diamondIgnitor();
>^
> symbol: class mcreator_diamondIgnitor
> location: class TestEnvironmentMod
>C:\Pylo\MCreator154\forge\build\sources\java\mod\mcreator\TestEnvironmentMod.java:115: error: cannot find symbol
>mcreator_goldDimension mcreator_7 = new mcreator_goldDimension();
>^
> symbol: class mcreator_goldDimension
> location: class TestEnvironmentMod
>C:\Pylo\MCreator154\forge\build\sources\java\mod\mcreator\TestEnvironmentMod.java:116: error: cannot find symbol
>mcreator_diamondDimension mcreator_8 = new mcreator_diamondDimension();
>^
> symbol: class mcreator_diamondDimension
> location: class TestEnvironmentMod
>C:\Pylo\MCreator154\forge\build\sources\java\mod\mcreator\TestEnvironmentMod.java:117: error: cannot find symbol
>mcreator_ironWorld mcreator_9 = new mcreator_ironWorld();
>^
> symbol: class mcreator_ironWorld
> location: class TestEnvironmentMod
>C:\Pylo\MCreator154\forge\build\sources\java\mod\mcreator\TestEnvironmentMod.java:118: error: cannot find symbol
>mcreator_goldWorld mcreator_10 = new mcreator_goldWorld();
>^
> symbol: class mcreator_goldWorld
> location: class TestEnvironmentMod
>C:\Pylo\MCreator154\forge\build\sources\java\mod\mcreator\TestEnvironmentMod.java:119: error: cannot find symbol
>mcreator_diamondWorld mcreator_11 = new mcreator_diamondWorld();
>^
> symbol: class mcreator_diamondWorld
> location: class TestEnvironmentMod
>C:\Pylo\MCreator154\forge\build\sources\java\mod\mcreator\TestEnvironmentMod.java:120: error: cannot find symbol
>mcreator_dIAMONDZ mcreator_12 = new mcreator_dIAMONDZ();
>^
> symbol: class mcreator_dIAMONDZ
> location: class TestEnvironmentMod
>C:\Pylo\MCreator154\forge\build\sources\java\mod\mcreator\TestEnvironmentMod.java:110: error: cannot find symbol
>mcreator_goldGrass mcreator_2 = new mcreator_goldGrass();
> ^
> symbol: class mcreator_goldGrass
> location: class TestEnvironmentMod
>C:\Pylo\MCreator154\forge\build\sources\java\mod\mcreator\TestEnvironmentMod.java:111: error: cannot find symbol
>mcreator_diamondGrass mcreator_3 = new mcreator_diamondGrass();
> ^
> symbol: class mcreator_diamondGrass
> location: class TestEnvironmentMod
>C:\Pylo\MCreator154\forge\build\sources\java\mod\mcreator\TestEnvironmentMod.java:112: error: cannot find symbol
>mcreator_ironIgnitor mcreator_4 = new mcreator_ironIgnitor();
> ^
> symbol: class mcreator_ironIgnitor
> location: class TestEnvironmentMod
>C:\Pylo\MCreator154\forge\build\sources\java\mod\mcreator\TestEnvironmentMod.java:113: error: cannot find symbol
>mcreator_goldIgnitor mcreator_5 = new mcreator_goldIgnitor();
> ^
> symbol: class mcreator_goldIgnitor
> location: class TestEnvironmentMod
>C:\Pylo\MCreator154\forge\build\sources\java\mod\mcreator\TestEnvironmentMod.java:114: error: cannot find symbol
>mcreator_diamondIgnitor mcreator_6 = new mcreator_diamondIgnitor();
> ^
> symbol: class mcreator_diamondIgnitor
> location: class TestEnvironmentMod
>C:\Pylo\MCreator154\forge\build\sources\java\mod\mcreator\TestEnvironmentMod.java:115: error: cannot find symbol
>mcreator_goldDimension mcreator_7 = new mcreator_goldDimension();
> ^
> symbol: class mcreator_goldDimension
> location: class TestEnvironmentMod
>C:\Pylo\MCreator154\forge\build\sources\java\mod\mcreator\TestEnvironmentMod.java:116: error: cannot find symbol
>mcreator_diamondDimension mcreator_8 = new mcreator_diamondDimension();
> ^
> symbol: class mcreator_diamondDimension
> location: class TestEnvironmentMod
>C:\Pylo\MCreator154\forge\build\sources\java\mod\mcreator\TestEnvironmentMod.java:117: error: cannot find symbol
>mcreator_ironWorld mcreator_9 = new mcreator_ironWorld();
> ^
> symbol: class mcreator_ironWorld
> location: class TestEnvironmentMod
>C:\Pylo\MCreator154\forge\build\sources\java\mod\mcreator\TestEnvironmentMod.java:118: error: cannot find symbol
>mcreator_goldWorld mcreator_10 = new mcreator_goldWorld();
> ^
> symbol: class mcreator_goldWorld
> location: class TestEnvironmentMod
>C:\Pylo\MCreator154\forge\build\sources\java\mod\mcreator\TestEnvironmentMod.java:119: error: cannot find symbol
>mcreator_diamondWorld mcreator_11 = new mcreator_diamondWorld();
> ^
> symbol: class mcreator_diamondWorld
> location: class TestEnvironmentMod
>C:\Pylo\MCreator154\forge\build\sources\java\mod\mcreator\TestEnvironmentMod.java:120: error: cannot find symbol
>mcreator_dIAMONDZ mcreator_12 = new mcreator_dIAMONDZ();
> ^
> symbol: class mcreator_dIAMONDZ
> location: class TestEnvironmentMod
>Note: C:\Pylo\MCreator154\forge\build\sources\java\mod\mcreator\mcreator_ironDimension.java uses or overrides a deprecated API.
>22 errors
>:compileJava FAILED
>FAILURE: Build failed with an exception.
>* What went wrong:
>Execution failed for task ':compileJava'.
>BUILD FAILED
>> Compilation failed; see the compiler error output>* Try:
for d>Total time: 21.508 secs
etails.
>Run with --stacktrace option to get the stack trace. Run with --info or --debug option to get more log output.
>C:\Pylo\MCreator154\forge>
>Task completed with return code 0 in 23117 milliseconds

Pages