Error on trying to test mod [1.8 - 1..57]

2 posts / 0 new
Last post
Offline
Last seen: 2 years 2 months ago
Joined: 12/15/2014 - 01:13
Gems: 0
Error on trying to test mod [1.8 - 1..57]

I get this error when i try to load my mod. [https://drive.google.com/open?id=0B7z9OJwhSb4HZWhzcldoR0I2NmM]

:clean
:downloadClient
:downloadServer
:getVersionJson
:extractUserDev FAILED
FAILURE: Build failed with an exception.
* What went wrong:
Execution failed for task ':extractUserDev'.
> java.util.zip.ZipException: invalid CEN header (bad signature)
BUILD FAILED
* Try:
Total time: 1 mins 25.234 secs
Run with --stacktrace option to get the stack trace. Run with --info or --debug option to get more log output.
E:\Software\MCreator157\forge>
Task completed with return code 0 in 85891 milliseconds
Task return code check OK!
 

 



Offline
Last seen: 1 week 11 hours ago
Joined: 06/01/2015 - 02:39
Gems: 8
Try this: https://mcreator