cant test new Blocks in mcreator

5 posts / 0 new
Last post
Offline
Last seen: 2 years 1 week ago
Joined: 08/16/2015 - 19:18
Gems: 0
cant test new Blocks in mcreator

Hi I'm New to Mcreator I just made a new block and I tried to test it in minecraft but it gave me a message saying that it's sill work in the backround and to try later so I waited for a bet but it kept tell me the same thing so I waited some more but it kept telling me the same message over again.I have mcreator for minecraft 1.8 can some tell me what is wrong?  

Edited by: Michaeljmccormic on 08/17/2015 - 01:19


Offline
Last seen: 1 year 3 months ago
Joined: 09/24/2014 - 02:35
Gems: 0
Get a print of your console

Get a print of your console and post here

Offline
Last seen: 2 years 1 week ago
Joined: 08/16/2015 - 19:18
Gems: 0
RE:Get a print of your console

Executing gradle command: clean runClient
Microsoft Windows [Version 6.0.6002]
Copyright (c) 2006 Microsoft Corporation.  All rights reserved.
C:\Users\Michael\Documents\MCreator 1.5.7 [1.8]>cd forge
C:\Users\Michael\Documents\MCreator 1.5.7 [1.8]\forge>SET "JAVA_HOME=C:\Users\Michael\Documents\MCreator 1.5.7 [1.8]\jdk\"
C:\Users\Michael\Documents\MCreator 1.5.7 [1.8]\forge>SET JAVA_EXE=%JAVA_HOME%\bin\java.exe
C:\Users\Michael\Documents\MCreator 1.5.7 [1.8]\forge>SET PATH=%JAVA_HOME%\bin\;%PATH%
C:\Users\Michael\Documents\MCreator 1.5.7 [1.8]\forge>gradlew clean runClient
****************************
 Powered By MCP:             
 http://modcoderpack.com/    
 Searge, ProfMobius, Fesh0r,
 R4wk, ZeuX, IngisKahn, bspkrs
 MCP Data version : snapshot_20141130
****************************
:clean
:downloadClient SKIPPED
:downloadServer SKIPPED
:getVersionJson
:extractUserDev
FAILURE: Build failed with an exception.
* What went wrong:
java.io.FileNotFoundException: C:\Users\Michael\Documents\MCreator 1.5.7 [1.8]\forge\.gradle\2.0\taskArtifacts\cache.properties (The system cannot find the file specified)
> C:\Users\Michael\Documents\MCreator 1.5.7 [1.8]\forge\.gradle\2.0\taskArtifacts\cache.properties (The system cannot find the file specified)
* Try:
BUILD FAILED
Total time: 29.917 secs
Run with --stacktrace option to get the stack trace. Run with --info or --debug option to get more log output.
C:\Users\Michael\Documents\MCreator 1.5.7 [1.8]\forge>
Task completed with return code 0 in 31418 milliseconds
Task return code check OK!

This is what it said

Offline
Last seen: 4 days 15 hours ago
Joined: 06/01/2015 - 02:39
Gems: 8
I am also unable to run the

I am also unable to run the client test environment, with the same error message.

Offline
Last seen: 4 days 15 hours ago
Joined: 06/01/2015 - 02:39
Gems: 8
I was able to fix the problem

I was able to fix the problem by following these instructions: https://mcreator.pylo.co/comment/8906#comment-8906

Hopefully that works for you.