FAILURE: Build failed with an exception.

1 post / 0 new
Offline
Last seen: 1 year 10 months ago
Joined: 08/13/2015 - 15:57
Gems: 0
FAILURE: Build failed with an exception.

What should i do ?

:clean
:downloadClient
FAILURE: Build failed with an exception.
* What went wrong:
BUILD FAILED
java.io.FileNotFoundException: C:\Pylo\MCreator157\forge\.gradle\2.0\taskArtifacts\cache.properties (Le fichier spécifié est > C:\Pylo\MCreator157\forge\.gradle\2.0\taskArtifacts\cache.properties (Le fichier spécifié est introuvable)
introuvable)
Total time: 10.006 secs
* Try:
Run with --stacktrace option to get the stack trace. Run with --info or --debug option to get more log output.
C:\Pylo\MCreator157\forge>
Task completed with return code 0 in 16283 milliseconds
Task return code check OK!