Export Error

2 posts / 0 new
Last post
Offline
Last seen: 1 year 6 months ago
Joined: 08/12/2015 - 12:19
Gems: 0
Export Error

Every time I try to export I choose where I want it to be Saved. Then I choose th ModName, Version, My Name, etc. and then the program crashes and no error message. So I check where I saved it and is wasn't there. So I try again but this time I click the Console tab to see if there's an error message. It says 

BOOTING UP GRADLE...
Data loaded, MCreator gradle console ready [ver 1.007]! [boot took 7 milliseconds]
RIGHT click once to copy log to the clipboard or twice to clear the log.
===================================================================================================================================
Executing gradle command: clean build
Microsoft Windows [Version 10.0.10240]
(c) 2015 Microsoft Corporation. All rights reserved.
C:\Pylo\MCreator157>cd forge
C:\Pylo\MCreator157\forge>SET "JAVA_HOME=C:\Pylo\MCreator157\jdk\"
C:\Pylo\MCreator157\forge>SET JAVA_EXE=%JAVA_HOME%\bin\java.exe
C:\Pylo\MCreator157\forge>SET PATH=%JAVA_HOME%\bin\;%PATH%
C:\Pylo\MCreator157\forge>gradlew clean build
****************************
 Powered By MCP:             
 http://modcoderpack.com/    
 Searge, ProfMobius, Fesh0r, 
 R4wk, ZeuX, IngisKahn, bspkrs
 MCP Data version : snapshot_20141130
****************************
:clean
:compileApiJava UP-TO-DATE
:processApiResources UP-TO-DATE
:apiClasses UP-TO-DATE
:sourceMainJava
FAILURE: Build failed with an exception.
* What went wrong:
java.io.FileNotFoundException: C:\Pylo\MCreator157\forge\.gradle\2.0\taskArtifacts\cache.properties (The system cannot find the file specified)
> C:\Pylo\MCreator157\forge\.gradle\2.0\taskArtifacts\cache.properties (The system cannot find the file specified)
* Try:
Run with --stacktrace option to get the stack trace. Run with --info or --debug option to get more log output.
BUILD FAILED
Total time: 18.471 secs

...then crash!

HELPPPPP!!!!!!!!!!!    What does stacktrace mean????

 

Edited by: KingConalGamer on 08/12/2015 - 17:32


Offline
Last seen: 1 year 6 months ago
Joined: 08/12/2015 - 12:19
Gems: 0
I found out to fix it....I

I found out to fix it....I went to C:\Pylo\MCreator157\forge\.gradle\2.0\taskArtifacts\cache.properties and found the one titled cache.prperties said cache.properties.lock so I renamed it to cache.properties then exported it and it worked!!! Hooray