3 posts / 0 new
Last post
Last seen: 2 months 5 days ago
Joined: 07/06/2015 - 08:34
Gems: 9

Hello im having trobble with making swords. i would make one recompile it and it fails. it says there is a problem with the previous mod but there isn't. please help

Executing gradle command: clean build
Microsoft Windows [Version 6.3.9600]
(c) 2013 Microsoft Corporation. All rights reserved.
C:\Pylo\MCreator157>cd forge
C:\Pylo\MCreator157\forge>SET "JAVA_HOME=C:\Pylo\MCreator157\jdk\"
C:\Pylo\MCreator157\forge>SET JAVA_EXE=%JAVA_HOME%\bin\java.exe
C:\Pylo\MCreator157\forge>SET PATH=%JAVA_HOME%\bin\;%PATH%
C:\Pylo\MCreator157\forge>gradlew clean build
 Powered By MCP:            
 Searge, ProfMobius, Fesh0r,
 R4wk, ZeuX, IngisKahn, bspkrs
 MCP Data version : snapshot_20141130
:compileApiJava UP-TO-DATE
:processApiResources UP-TO-DATE
:apiClasses UP-TO-DATE
C:\Pylo\MCreator157\forge\build\sources\java\mod\mcreator\mcreator_amethystSword.java:126: error: cannot find symbol
int j = (int)(entity.prevPosY + (entity.posY - entity.prevPosY) * (double)var4 + 1.62D - (double)entity.yOffset);
  symbol:   variable yOffset
:compileJava FAILED
  location: variable entity of type EntityPlayer
1 error
FAILURE: Build failed with an exception.
* What went wrong:
Execution failed for task ':compileJava'.
> Compilation failed; see the compiler error output for details.
* Try:
Run with --stacktrace option to get the stack trace. Run with --info or --debug option to get more log output.
Total time: 51.444 secs
Task completed with return code 0 in 55287 milliseconds

Edited by: BaKonator751 on 07/31/2015 - 18:18

Last seen: 3 months 2 weeks ago
Joined: 06/28/2015 - 08:32
Gems: 0
Events are broken in the

Events are broken in the current version, are you using an event on your sword?

Last seen: 2 months 5 days ago
Joined: 07/06/2015 - 08:34
Gems: 9
Ahhh ok

Ahhh ok