Execution failed for task ':reobf'.

1 post / 0 new
Offline
Last seen: 1 year 8 months ago
Joined: 10/12/2013 - 23:42
Gems: 0
Execution failed for task ':reobf'.

When I tried to make a block it cames this

Executing gradle command: clean build
Microsoft Windows [Versi¢n 6.1.7601]
Copyright (c) 2009 Microsoft Corporation. Reservados todos los derechos.
Executing gradle command: clean build
C:\Pylo\MCreator157>cd forge
C:\Pylo\MCreator157\forge>SET "JAVA_HOME=C:\Pylo\MCreator157\jdk\"
C:\Pylo\MCreator157\forge>SET JAVA_EXE=%JAVA_HOME%\bin\java.exe
C:\Pylo\MCreator157\forge>SET PATH=%JAVA_HOME%\bin\;%PATH%
C:\Pylo\MCreator157\forge>gradlew clean build
****************************
 Powered By MCP:             
 http://mcp.ocean-labs.de/   
 Searge, ProfMobius, Fesh0r, 
 R4wk, ZeuX, IngisKahn, bspkrs
 MCP Data version : snapshot_20141130
****************************
:clean
:compileApiJava UP-TO-DATE
:processApiResources UP-TO-DATE
:apiClasses UP-TO-DATE
:sourceMainJava
:compileJava
:processResources
:classes
:jar
:compileTestJava UP-TO-DATE
:processTestResources UP-TO-DATE
:testClasses UP-TO-DATE
:test UP-TO-DATE
:extractMcpData UP-TO-DATE
:getVersionJson
:extractUserDev UP-TO-DATE
:genSrgs SKIPPED
:reobf FAILED
FAILURE: Build failed with an exception.
* What went wrong:
Execution failed for task ':reobf'.
> MALFORMED
* Try:
Run with --stacktrace option to get the stack trace. Run with --info or --debug option to get more log output.
BUILD FAILED
Total time: 37.531 secs
C:\Pylo\MCreator157\forge>
Task completed with return code 0 in 38508 milliseconds
Task return code check OK!