I need help because...this

1 post / 0 new
ModderHD's picture
Offline
Last seen: 1 month 2 weeks ago
Joined: 07/20/2014 - 02:26
Gems: 6
I need help because...this

Gradle commands always fail.When the command "build" is run,this happens:

>BOOTING UP GRADLE...
>Data loaded, MCreator gradle console ready [ver 1.007]! [boot took 8 milliseconds]
>RIGHT click once to copy log to the clipboard or twice to clear the log.
>=========================================================================================================================
>Executing gradle command: build
>Microsoft Windows [Version 6.3.9600]
>(c) 2013 Microsoft Corporation. All rights reserved.
>C:\Users\Chris\Desktop\Mcreator>cd forge
>C:\Users\Chris\Desktop\Mcreator\forge>SET "JAVA_HOME=C:\Users\Chris\Desktop\Mcreator\jdk\"
>C:\Users\Chris\Desktop\Mcreator\forge>SET JAVA_EXE=%JAVA_HOME%\bin\java.exe
>C:\Users\Chris\Desktop\Mcreator\forge>SET PATH=%JAVA_HOME%\bin\;%PATH%
>C:\Users\Chris\Desktop\Mcreator\forge>gradlew build
>****************************
> Powered By MCP:             
> http://mcp.ocean-labs.de/   
> Searge, ProfMobius, Fesh0r, 
> R4wk, ZeuX, IngisKahn, bspkrs
> MCP Data version : unknown
>****************************
>:compileApiJava UP-TO-DATE
>:processApiResources UP-TO-DATE
>:apiClasses UP-TO-DATE
>:sourceMainJava
>FAILURE: Build failed with an exception.
>* What went wrong:
>java.io.FileNotFoundException: C:\Users\Chris\Desktop\Mcreator\forge\.gradle\2.0\taskArtifacts\cache.properties (The system cannot find the file specified)
>> C:\Users\Chris\Desktop\Mcreator\forge\.gradle\2.0\taskArtifacts\cache.properties (The system cannot find the file specified)
>* Try:
>Run with --stacktrace option to get the stack trace. Run with --info or --debug option to get more log output.
>BUILD FAILED
>Total time: 11.174 secs
>C:\Users\Chris\Desktop\Mcreator\forge>
>Task completed with return code 0 in 11786 milliseconds
>Task return code check OK!