My Mod Suddenly broke Please help.

1 post / 0 new
Offline
Last seen: 1 year 7 months ago
Joined: 07/02/2015 - 02:39
Gems: 0
My Mod Suddenly broke Please help.

My mod was working fine and nothing was wrong so I decided to stop working for the night.  So I shut down MCreator and when I booted it up in the morning almost everything had stopped working.  This is all the console has:

>Executing gradle command: build
>Microsoft Windows [Version 6.3.9600]
>(c) 2013 Microsoft Corporation. All rights reserved.
>C:\Pylo\MCreator>cd forge
>C:\Pylo\MCreator\forge>SET "JAVA_HOME=C:\Pylo\MCreator\jdk\"
>C:\Pylo\MCreator\forge>SET JAVA_EXE=%JAVA_HOME%\bin\java.exe
>C:\Pylo\MCreator\forge>SET PATH=%JAVA_HOME%\bin\;%PATH%
>C:\Pylo\MCreator\forge>gradlew build
>****************************
> Powered By MCP:            
> http://mcp.ocean-labs.de/  
> Searge, ProfMobius, Fesh0r,
> R4wk, ZeuX, IngisKahn, bspkrs
> MCP Data version : unknown
>****************************
>:compileApiJava UP-TO-DATE
>:processApiResources UP-TO-DATE
>:apiClasses UP-TO-DATE
>:sourceMainJava UP-TO-DATE
>C:\Pylo\MCreator\forge\build\sources\java\mod\mcreator\TestEnvironmentMod.java:109: error: cannot find symbol
>mcreator_aluminumOre mcreator_1 = new mcreator_aluminumOre();
>^
>  symbol:   class mcreator_aluminumOre
>  location: class TestEnvironmentMod
>C:\Pylo\MCreator\forge\build\sources\java\mod\mcreator\TestEnvironmentMod.java:110: error: cannot find symbol
>mcreator_dust mcreator_2 = new mcreator_dust();
>^
>  symbol:   class mcreator_dust
>  location: class TestEnvironmentMod
>C:\Pylo\MCreator\forge\build\sources\java\mod\mcreator\TestEnvironmentMod.java:111: error: cannot find symbol
>mcreator_itemBullet mcreator_3 = new mcreator_itemBullet();
>^
>  symbol:   class mcreator_itemBullet
>  location: class TestEnvironmentMod
>C:\Pylo\MCreator\forge\build\sources\java\mod\mcreator\TestEnvironmentMod.java:112: error: cannot find symbol
>mcreator_aK47 mcreator_4 = new mcreator_aK47();
>^
>  symbol:   class mcreator_aK47
>  location: class TestEnvironmentMod
>C:\Pylo\MCreator\forge\build\sources\java\mod\mcreator\TestEnvironmentMod.java:113: error: cannot find symbol
>mcreator_foodPopcorn mcreator_5 = new mcreator_foodPopcorn();
>^
>  symbol:   class mcreator_foodPopcorn
>  location: class TestEnvironmentMod
>C:\Pylo\MCreator\forge\build\sources\java\mod\mcreator\TestEnvironmentMod.java:114: error: cannot find symbol
>mcreator_foodChickenLeg mcreator_6 = new mcreator_foodChickenLeg();
>^
>  symbol:   class mcreator_foodChickenLeg
>  location: class TestEnvironmentMod
>C:\Pylo\MCreator\forge\build\sources\java\mod\mcreator\TestEnvironmentMod.java:115: error: cannot find symbol
>mcreator_armorAluminum mcreator_7 = new mcreator_armorAluminum();
>^
>  symbol:   class mcreator_armorAluminum
>  location: class TestEnvironmentMod
>C:\Pylo\MCreator\forge\build\sources\java\mod\mcreator\TestEnvironmentMod.java:116: error: cannot find symbol
>mcreator_itemNecrogem mcreator_8 = new mcreator_itemNecrogem();
>^
>  symbol:   class mcreator_itemNecrogem
>  location: class TestEnvironmentMod
>C:\Pylo\MCreator\forge\build\sources\java\mod\mcreator\TestEnvironmentMod.java:117: error: cannot find symbol
>mcreator_oreNecrite mcreator_9 = new mcreator_oreNecrite();
>^
>  symbol:   class mcreator_oreNecrite
>  location: class TestEnvironmentMod
>C:\Pylo\MCreator\forge\build\sources\java\mod\mcreator\TestEnvironmentMod.java:118: error: cannot find symbol
>mcreator_armorNecrite mcreator_10 = new mcreator_armorNecrite();
>^
>  symbol:   class mcreator_armorNecrite
>  location: class TestEnvironmentMod
>C:\Pylo\MCreator\forge\build\sources\java\mod\mcreator\TestEnvironmentMod.java:119: error: cannot find symbol
>mcreator_weaponNecriteSword mcreator_11 = new mcreator_weaponNecriteSword();
>^
>  symbol:   class mcreator_weaponNecriteSword
>  location: class TestEnvironmentMod
>C:\Pylo\MCreator\forge\build\sources\java\mod\mcreator\TestEnvironmentMod.java:120: error: cannot find symbol
>mcreator_pickaxeNecrite mcreator_12 = new mcreator_pickaxeNecrite();
>^
>  symbol:   class mcreator_pickaxeNecrite
>  location: class TestEnvironmentMod
>C:\Pylo\MCreator\forge\build\sources\java\mod\mcreator\TestEnvironmentMod.java:121: error: cannot find symbol
>mcreator_axeNecrite mcreator_13 = new mcreator_axeNecrite();
>^
>  symbol:   class mcreator_axeNecrite
>  location: class TestEnvironmentMod
>C:\Pylo\MCreator\forge\build\sources\java\mod\mcreator\TestEnvironmentMod.java:122: error: cannot find symbol
>mcreator_shovelNecrite mcreator_14 = new mcreator_shovelNecrite();
>^
>  symbol:   class mcreator_shovelNecrite
>  location: class TestEnvironmentMod
>C:\Pylo\MCreator\forge\build\sources\java\mod\mcreator\TestEnvironmentMod.java:123: error: cannot find symbol
>mcreator_hoeNecrite mcreator_15 = new mcreator_hoeNecrite();
>^
>  symbol:   class mcreator_hoeNecrite
>  location: class TestEnvironmentMod
>C:\Pylo\MCreator\forge\build\sources\java\mod\mcreator\TestEnvironmentMod.java:124: error: cannot find symbol
>mcreator_dimensionWater mcreator_16 = new mcreator_dimensionWater();
>^
>  symbol:   class mcreator_dimensionWater
>  location: class TestEnvironmentMod
>C:\Pylo\MCreator\forge\build\sources\java\mod\mcreator\TestEnvironmentMod.java:125: error: cannot find symbol
>mcreator_everground mcreator_17 = new mcreator_everground();
>^
>  symbol:   class mcreator_everground
>  location: class TestEnvironmentMod
>C:\Pylo\MCreator\forge\build\sources\java\mod\mcreator\TestEnvironmentMod.java:126: error: cannot find symbol
>mcreator_dimensionBiome mcreator_18 = new mcreator_dimensionBiome();
>^
>  symbol:   class mcreator_dimensionBiome
>  location: class TestEnvironmentMod
>C:\Pylo\MCreator\forge\build\sources\java\mod\mcreator\TestEnvironmentMod.java:127: error: cannot find symbol
>mcreator_everythingDimension mcreator_19 = new mcreator_everythingDimension();
>^
>  symbol:   class mcreator_everythingDimension
>  location: class TestEnvironmentMod
>C:\Pylo\MCreator\forge\build\sources\java\mod\mcreator\TestEnvironmentMod.java:128: error: cannot find symbol
>mcreator_blockNecrite mcreator_20 = new mcreator_blockNecrite();
>^
>  symbol:   class mcreator_blockNecrite
>  location: class TestEnvironmentMod
>C:\Pylo\MCreator\forge\build\sources\java\mod\mcreator\TestEnvironmentMod.java:129: error: cannot find symbol
>mcreator_blockAluminum mcreator_21 = new mcreator_blockAluminum();
>^
>  symbol:   class mcreator_blockAluminum
>  location: class TestEnvironmentMod
>C:\Pylo\MCreator\forge\build\sources\java\mod\mcreator\TestEnvironmentMod.java:130: error: cannot find symbol
>mcreator_axeAluminum mcreator_22 = new mcreator_axeAluminum();
>^
>  symbol:   class mcreator_axeAluminum
>  location: class TestEnvironmentMod
>C:\Pylo\MCreator\forge\build\sources\java\mod\mcreator\TestEnvironmentMod.java:131: error: cannot find symbol
>mcreator_pickaxeAluminum mcreator_23 = new mcreator_pickaxeAluminum();
>^
>  symbol:   class mcreator_pickaxeAluminum
>  location: class TestEnvironmentMod
>C:\Pylo\MCreator\forge\build\sources\java\mod\mcreator\TestEnvironmentMod.java:132: error: cannot find symbol
>mcreator_hoeAluminum mcreator_24 = new mcreator_hoeAluminum();
>^
>  symbol:   class mcreator_hoeAluminum
>  location: class TestEnvironmentMod
>C:\Pylo\MCreator\forge\build\sources\java\mod\mcreator\TestEnvironmentMod.java:133: error: cannot find symbol
>mcreator_shovelAluminum mcreator_25 = new mcreator_shovelAluminum();
>^
>  symbol:   class mcreator_shovelAluminum
>  location: class TestEnvironmentMod
>C:\Pylo\MCreator\forge\build\sources\java\mod\mcreator\TestEnvironmentMod.java:134: error: cannot find symbol
>mcreator_itemEnergem mcreator_26 = new mcreator_itemEnergem();
>^
>  symbol:   class mcreator_itemEnergem
>  location: class TestEnvironmentMod
>C:\Pylo\MCreator\forge\build\sources\java\mod\mcreator\TestEnvironmentMod.java:135: error: cannot find symbol
>mcreator_blockEnergemOre mcreator_27 = new mcreator_blockEnergemOre();
>^
>  symbol:   class mcreator_blockEnergemOre
>  location: class TestEnvironmentMod
>C:\Pylo\MCreator\forge\build\sources\java\mod\mcreator\TestEnvironmentMod.java:136: error: cannot find symbol
>mcreator_animagem mcreator_28 = new mcreator_animagem();
>^
>  symbol:   class mcreator_animagem
>  location: class TestEnvironmentMod
>C:\Pylo\MCreator\forge\build\sources\java\mod\mcreator\TestEnvironmentMod.java:137: error: cannot find symbol
>mcreator_blockAnimagemOre mcreator_29 = new mcreator_blockAnimagemOre();
>^
>  symbol:   class mcreator_blockAnimagemOre
>  location: class TestEnvironmentMod
>C:\Pylo\MCreator\forge\build\sources\java\mod\mcreator\TestEnvironmentMod.java:138: error: cannot find symbol
>mcreator_weaponEnergemSword mcreator_30 = new mcreator_weaponEnergemSword();
>^
>  symbol:   class mcreator_weaponEnergemSword
>  location: class TestEnvironmentMod
>C:\Pylo\MCreator\forge\build\sources\java\mod\mcreator\TestEnvironmentMod.java:139: error: cannot find symbol
>mcreator_energemAxe mcreator_31 = new mcreator_energemAxe();
>^
>  symbol:   class mcreator_energemAxe
>  location: class TestEnvironmentMod
>C:\Pylo\MCreator\forge\build\sources\java\mod\mcreator\TestEnvironmentMod.java:140: error: cannot find symbol
>mcreator_energemPickaxe mcreator_32 = new mcreator_energemPickaxe();
>^
>  symbol:   class mcreator_energemPickaxe
>  location: class TestEnvironmentMod
>C:\Pylo\MCreator\forge\build\sources\java\mod\mcreator\TestEnvironmentMod.java:141: error: cannot find symbol
>mcreator_energemHoe mcreator_33 = new mcreator_energemHoe();
>^
>  symbol:   class mcreator_energemHoe
>  location: class TestEnvironmentMod
>C:\Pylo\MCreator\forge\build\sources\java\mod\mcreator\TestEnvironmentMod.java:142: error: cannot find symbol
>mcreator_energemShovel mcreator_34 = new mcreator_energemShovel();
>^
>  symbol:   class mcreator_energemShovel
>  location: class TestEnvironmentMod
>C:\Pylo\MCreator\forge\build\sources\java\mod\mcreator\TestEnvironmentMod.java:143: error: cannot find symbol
>mcreator_energemArmor mcreator_35 = new mcreator_energemArmor();
>^
>  symbol:   class mcreator_energemArmor
>  location: class TestEnvironmentMod
>C:\Pylo\MCreator\forge\build\sources\java\mod\mcreator\TestEnvironmentMod.java:144: error: cannot find symbol
>mcreator_energemBlock mcreator_36 = new mcreator_energemBlock();
>^
>  symbol:   class mcreator_energemBlock
>  location: class TestEnvironmentMod
>C:\Pylo\MCreator\forge\build\sources\java\mod\mcreator\TestEnvironmentMod.java:145: error: cannot find symbol
>mcreator_animagemBlock mcreator_37 = new mcreator_animagemBlock();
>^
>  symbol:   class mcreator_animagemBlock
>  location: class TestEnvironmentMod
>C:\Pylo\MCreator\forge\build\sources\java\mod\mcreator\TestEnvironmentMod.java:146: error: cannot find symbol
>mcreator_animagemPickaxe mcreator_38 = new mcreator_animagemPickaxe();
>^
>  symbol:   class mcreator_animagemPickaxe
>  location: class TestEnvironmentMod
>C:\Pylo\MCreator\forge\build\sources\java\mod\mcreator\TestEnvironmentMod.java:147: error: cannot find symbol
>mcreator_animagemHoe mcreator_39 = new mcreator_animagemHoe();
>^
>  symbol:   class mcreator_animagemHoe
>  location: class TestEnvironmentMod
>C:\Pylo\MCreator\forge\build\sources\java\mod\mcreator\TestEnvironmentMod.java:148: error: cannot find symbol
>mcreator_animagemArmor mcreator_40 = new mcreator_animagemArmor();
>^
>  symbol:   class mcreator_animagemArmor
>  location: class TestEnvironmentMod
>C:\Pylo\MCreator\forge\build\sources\java\mod\mcreator\TestEnvironmentMod.java:149: error: cannot find symbol
>mcreator_animagemSword mcreator_41 = new mcreator_animagemSword();
>^
>  symbol:   class mcreator_animagemSword
>  location: class TestEnvironmentMod
>C:\Pylo\MCreator\forge\build\sources\java\mod\mcreator\TestEnvironmentMod.java:150: error: cannot find symbol
>mcreator_animagemShovel mcreator_42 = new mcreator_animagemShovel();
>^
>  symbol:   class mcreator_animagemShovel
>  location: class TestEnvironmentMod
>C:\Pylo\MCreator\forge\build\sources\java\mod\mcreator\TestEnvironmentMod.java:151: error: cannot find symbol
>mcreator_animagemAxe mcreator_43 = new mcreator_animagemAxe();
>^
>  symbol:   class mcreator_animagemAxe
>  location: class TestEnvironmentMod
>C:\Pylo\MCreator\forge\build\sources\java\mod\mcreator\TestEnvironmentMod.java:152: error: cannot find symbol
>mcreator_necroGroundBlock mcreator_44 = new mcreator_necroGroundBlock();
>^
>  symbol:   class mcreator_necroGroundBlock
>  location: class TestEnvironmentMod
>C:\Pylo\MCreator\forge\build\sources\java\mod\mcreator\TestEnvironmentMod.java:153: error: cannot find symbol
>mcreator_necroDimensionBiome mcreator_45 = new mcreator_necroDimensionBiome();
>^
>  symbol:   class mcreator_necroDimensionBiome
>  location: class TestEnvironmentMod
>C:\Pylo\MCreator\forge\build\sources\java\mod\mcreator\TestEnvironmentMod.java:154: error: cannot find symbol
>mcreator_necroWater mcreator_46 = new mcreator_necroWater();
>^
>  symbol:   class mcreator_necroWater
>  location: class TestEnvironmentMod
>C:\Pylo\MCreator\forge\build\sources\java\mod\mcreator\TestEnvironmentMod.java:155: error: cannot find symbol
>mcreator_necroDimension mcreator_47 = new mcreator_necroDimension();
>^
>  symbol:   class mcreator_necroDimension
>  location: class TestEnvironmentMod
>C:\Pylo\MCreator\forge\build\sources\java\mod\mcreator\TestEnvironmentMod.java:156: error: cannot find symbol
>mcreator_gemVires mcreator_48 = new mcreator_gemVires();
>^
>  symbol:   class mcreator_gemVires
>  location: class TestEnvironmentMod
>C:\Pylo\MCreator\forge\build\sources\java\mod\mcreator\TestEnvironmentMod.java:157: error: cannot find symbol
>mcreator_blockVires mcreator_49 = new mcreator_blockVires();
>^
>  symbol:   class mcreator_blockVires
>  location: class TestEnvironmentMod
>C:\Pylo\MCreator\forge\build\sources\java\mod\mcreator\TestEnvironmentMod.java:158: error: cannot find symbol
>mcreator_oreVires mcreator_50 = new mcreator_oreVires();
>^
>  symbol:   class mcreator_oreVires
>  location: class TestEnvironmentMod
>C:\Pylo\MCreator\forge\build\sources\java\mod\mcreator\TestEnvironmentMod.java:159: error: cannot find symbol
>mcreator_pickaxeVires mcreator_51 = new mcreator_pickaxeVires();
>^
>  symbol:   class mcreator_pickaxeVires
>  location: class TestEnvironmentMod
>C:\Pylo\MCreator\forge\build\sources\java\mod\mcreator\TestEnvironmentMod.java:160: error: cannot find symbol
>mcreator_swordVires mcreator_52 = new mcreator_swordVires();
>^
>  symbol:   class mcreator_swordVires
>  location: class TestEnvironmentMod
>C:\Pylo\MCreator\forge\build\sources\java\mod\mcreator\TestEnvironmentMod.java:161: error: cannot find symbol
>mcreator_hoeVires mcreator_53 = new mcreator_hoeVires();
>^
>  symbol:   class mcreator_hoeVires
>  location: class TestEnvironmentMod
>C:\Pylo\MCreator\forge\build\sources\java\mod\mcreator\TestEnvironmentMod.java:162: error: cannot find symbol
>mcreator_axeVires mcreator_54 = new mcreator_axeVires();
>^
>  symbol:   class mcreator_axeVires
>  location: class TestEnvironmentMod
>C:\Pylo\MCreator\forge\build\sources\java\mod\mcreator\TestEnvironmentMod.java:163: error: cannot find symbol
>mcreator_shovelVires mcreator_55 = new mcreator_shovelVires();
>^
>  symbol:   class mcreator_shovelVires
>  location: class TestEnvironmentMod
>C:\Pylo\MCreator\forge\build\sources\java\mod\mcreator\TestEnvironmentMod.java:164: error: cannot find symbol
>mcreator_armorVires mcreator_56 = new mcreator_armorVires();
>^
>  symbol:   class mcreator_armorVires
>  location: class TestEnvironmentMod
>C:\Pylo\MCreator\forge\build\sources\java\mod\mcreator\TestEnvironmentMod.java:109: error: cannot find symbol
>mcreator_aluminumOre mcreator_1 = new mcreator_aluminumOre();
>                                      ^
>  symbol:   class mcreator_aluminumOre
>  location: class TestEnvironmentMod
>C:\Pylo\MCreator\forge\build\sources\java\mod\mcreator\TestEnvironmentMod.java:110: error: cannot find symbol
>mcreator_dust mcreator_2 = new mcreator_dust();
>                               ^
>  symbol:   class mcreator_dust
>  location: class TestEnvironmentMod
>C:\Pylo\MCreator\forge\build\sources\java\mod\mcreator\TestEnvironmentMod.java:111: error: cannot find symbol
>mcreator_itemBullet mcreator_3 = new mcreator_itemBullet();
>                                     ^
>  symbol:   class mcreator_itemBullet
>  location: class TestEnvironmentMod
>C:\Pylo\MCreator\forge\build\sources\java\mod\mcreator\TestEnvironmentMod.java:112: error: cannot find symbol
>mcreator_aK47 mcreator_4 = new mcreator_aK47();
>                               ^
>  symbol:   class mcreator_aK47
>  location: class TestEnvironmentMod
>C:\Pylo\MCreator\forge\build\sources\java\mod\mcreator\TestEnvironmentMod.java:113: error: cannot find symbol
>mcreator_foodPopcorn mcreator_5 = new mcreator_foodPopcorn();
>                                      ^
>  symbol:   class mcreator_foodPopcorn
>  location: class TestEnvironmentMod
>C:\Pylo\MCreator\forge\build\sources\java\mod\mcreator\TestEnvironmentMod.java:114: error: cannot find symbol
>mcreator_foodChickenLeg mcreator_6 = new mcreator_foodChickenLeg();
>                                         ^
>  symbol:   class mcreator_foodChickenLeg
>  location: class TestEnvironmentMod
>C:\Pylo\MCreator\forge\build\sources\java\mod\mcreator\TestEnvironmentMod.java:115: error: cannot find symbol
>mcreator_armorAluminum mcreator_7 = new mcreator_armorAluminum();
>                                        ^
>  symbol:   class mcreator_armorAluminum
>  location: class TestEnvironmentMod
>C:\Pylo\MCreator\forge\build\sources\java\mod\mcreator\TestEnvironmentMod.java:116: error: cannot find symbol
>mcreator_itemNecrogem mcreator_8 = new mcreator_itemNecrogem();
>                                       ^
>  symbol:   class mcreator_itemNecrogem
>  location: class TestEnvironmentMod
>C:\Pylo\MCreator\forge\build\sources\java\mod\mcreator\TestEnvironmentMod.java:117: error: cannot find symbol
>mcreator_oreNecrite mcreator_9 = new mcreator_oreNecrite();
>                                     ^
>  symbol:   class mcreator_oreNecrite
>  location: class TestEnvironmentMod
>C:\Pylo\MCreator\forge\build\sources\java\mod\mcreator\TestEnvironmentMod.java:118: error: cannot find symbol
>mcreator_armorNecrite mcreator_10 = new mcreator_armorNecrite();
>                                        ^
>  symbol:   class mcreator_armorNecrite
>  location: class TestEnvironmentMod
>C:\Pylo\MCreator\forge\build\sources\java\mod\mcreator\TestEnvironmentMod.java:119: error: cannot find symbol
>mcreator_weaponNecriteSword mcreator_11 = new mcreator_weaponNecriteSword();
>                                              ^
>  symbol:   class mcreator_weaponNecriteSword
>  location: class TestEnvironmentMod
>C:\Pylo\MCreator\forge\build\sources\java\mod\mcreator\TestEnvironmentMod.java:120: error: cannot find symbol
>mcreator_pickaxeNecrite mcreator_12 = new mcreator_pickaxeNecrite();
>                                          ^
>  symbol:   class mcreator_pickaxeNecrite
>  location: class TestEnvironmentMod
>C:\Pylo\MCreator\forge\build\sources\java\mod\mcreator\TestEnvironmentMod.java:121: error: cannot find symbol
>mcreator_axeNecrite mcreator_13 = new mcreator_axeNecrite();
>                                      ^
>  symbol:   class mcreator_axeNecrite
>  location: class TestEnvironmentMod
>C:\Pylo\MCreator\forge\build\sources\java\mod\mcreator\TestEnvironmentMod.java:122: error: cannot find symbol
>mcreator_shovelNecrite mcreator_14 = new mcreator_shovelNecrite();
>                                         ^
>  symbol:   class mcreator_shovelNecrite
>  location: class TestEnvironmentMod
>C:\Pylo\MCreator\forge\build\sources\java\mod\mcreator\TestEnvironmentMod.java:123: error: cannot find symbol
>mcreator_hoeNecrite mcreator_15 = new mcreator_hoeNecrite();
>                                      ^
>  symbol:   class mcreator_hoeNecrite
>  location: class TestEnvironmentMod
>C:\Pylo\MCreator\forge\build\sources\java\mod\mcreator\TestEnvironmentMod.java:124: error: cannot find symbol
>mcreator_dimensionWater mcreator_16 = new mcreator_dimensionWater();
>                                          ^
>  symbol:   class mcreator_dimensionWater
>  location: class TestEnvironmentMod
>C:\Pylo\MCreator\forge\build\sources\java\mod\mcreator\TestEnvironmentMod.java:125: error: cannot find symbol
>mcreator_everground mcreator_17 = new mcreator_everground();
>                                      ^
>  symbol:   class mcreator_everground
>  location: class TestEnvironmentMod
>C:\Pylo\MCreator\forge\build\sources\java\mod\mcreator\TestEnvironmentMod.java:126: error: cannot find symbol
>mcreator_dimensionBiome mcreator_18 = new mcreator_dimensionBiome();
>                                          ^
>  symbol:   class mcreator_dimensionBiome
>  location: class TestEnvironmentMod
>C:\Pylo\MCreator\forge\build\sources\java\mod\mcreator\TestEnvironmentMod.java:127: error: cannot find symbol
>mcreator_everythingDimension mcreator_19 = new mcreator_everythingDimension();
>                                               ^
>  symbol:   class mcreator_everythingDimension
>  location: class TestEnvironmentMod
>C:\Pylo\MCreator\forge\build\sources\java\mod\mcreator\TestEnvironmentMod.java:128: error: cannot find symbol
>mcreator_blockNecrite mcreator_20 = new mcreator_blockNecrite();
>                                        ^
>  symbol:   class mcreator_blockNecrite
>  location: class TestEnvironmentMod
>C:\Pylo\MCreator\forge\build\sources\java\mod\mcreator\TestEnvironmentMod.java:129: error: cannot find symbol
>mcreator_blockAluminum mcreator_21 = new mcreator_blockAluminum();
>                                         ^
>  symbol:   class mcreator_blockAluminum
>  location: class TestEnvironmentMod
>C:\Pylo\MCreator\forge\build\sources\java\mod\mcreator\TestEnvironmentMod.java:130: error: cannot find symbol
>mcreator_axeAluminum mcreator_22 = new mcreator_axeAluminum();
>                                       ^
>  symbol:   class mcreator_axeAluminum
>  location: class TestEnvironmentMod
>C:\Pylo\MCreator\forge\build\sources\java\mod\mcreator\TestEnvironmentMod.java:131: error: cannot find symbol
>mcreator_pickaxeAluminum mcreator_23 = new mcreator_pickaxeAluminum();
>                                           ^
>  symbol:   class mcreator_pickaxeAluminum
>  location: class TestEnvironmentMod
>C:\Pylo\MCreator\forge\build\sources\java\mod\mcreator\TestEnvironmentMod.java:132: error: cannot find symbol
>mcreator_hoeAluminum mcreator_24 = new mcreator_hoeAluminum();
>                                       ^
>  symbol:   class mcreator_hoeAluminum
>  location: class TestEnvironmentMod
>C:\Pylo\MCreator\forge\build\sources\java\mod\mcreator\TestEnvironmentMod.java:133: error: cannot find symbol
>mcreator_shovelAluminum mcreator_25 = new mcreator_shovelAluminum();
>                                          ^
>  symbol:   class mcreator_shovelAluminum
>  location: class TestEnvironmentMod
>C:\Pylo\MCreator\forge\build\sources\java\mod\mcreator\TestEnvironmentMod.java:134: error: cannot find symbol
>mcreator_itemEnergem mcreator_26 = new mcreator_itemEnergem();
>                                       ^
>  symbol:   class mcreator_itemEnergem
>  location: class TestEnvironmentMod
>C:\Pylo\MCreator\forge\build\sources\java\mod\mcreator\TestEnvironmentMod.java:135: error: cannot find symbol
>mcreator_blockEnergemOre mcreator_27 = new mcreator_blockEnergemOre();
>                                           ^
>  symbol:   class mcreator_blockEnergemOre
>  location: class TestEnvironmentMod
>C:\Pylo\MCreator\forge\build\sources\java\mod\mcreator\TestEnvironmentMod.java:136: error: cannot find symbol
>mcreator_animagem mcreator_28 = new mcreator_animagem();
>                                    ^
>  symbol:   class mcreator_animagem
>  location: class TestEnvironmentMod
>C:\Pylo\MCreator\forge\build\sources\java\mod\mcreator\TestEnvironmentMod.java:137: error: cannot find symbol
>mcreator_blockAnimagemOre mcreator_29 = new mcreator_blockAnimagemOre();
>                                            ^
>  symbol:   class mcreator_blockAnimagemOre
>  location: class TestEnvironmentMod
>C:\Pylo\MCreator\forge\build\sources\java\mod\mcreator\TestEnvironmentMod.java:138: error: cannot find symbol
>mcreator_weaponEnergemSword mcreator_30 = new mcreator_weaponEnergemSword();
>                                              ^
>  symbol:   class mcreator_weaponEnergemSword
>  location: class TestEnvironmentMod
>C:\Pylo\MCreator\forge\build\sources\java\mod\mcreator\TestEnvironmentMod.java:139: error: cannot find symbol
>:compileJava FAILED
>mcreator_energemAxe mcreator_31 = new mc>                                      ^
reator_energemAxe();
>  symbol:   class mcreator_energemAxe
>  location: class TestEnvironmentMod
>C:\Pylo\MCreator\forge\build\sources\java\mod\mcreator\TestEnvironmentMod.java:140: error: cannot find symbol
>mcreator_energemPickaxe mcreator_32 = new mcreator_energemPickaxe();
>BUILD FAILED
>                                          ^
>  symbol:   class mcreator_energemPickaxe
>  location: class TestEnvironmentMod
>C:\Pylo\MCreator\forge\build\sources\java\mod\mcreator\TestEnvironmentMod.java:141: error: cannot find symbol
>mcreator_energemHoe mcreator_33 = new mcreator_energemHoe();
>                          >  symbol:   class mcreator_energemHoe
            ^
>  location: class TestEnvironmentMod
>Total time: 18.989 secs
>C:\Pylo\MCreator\forge\build\sources\java\mod\mcreator\TestEnvironmentMod.java:142: error: cannot find symbol
>mcreator_energemShovel mcreator_34 = new mcreator_energemShovel();
>                                         ^
>  symbol:   class mcreator_energemShovel
>  location: class TestEnvironmentMod
>C:\Pylo\MCreator\forge\build\sources\java\mod\mcreator\TestEnvironmentMod.java:143: error: cannot find symbol
>mcreator_energemArmor mcreator_35 = new mcreator_energemArmor();
>                                        ^
>  symbol:   class mcreator_energemArmor
>  location: class TestEnvironmentMod
>C:\Pylo\MCreator\forge\build\sources\java\mod\mcreator\TestEnvironmentMod.java:144: error: cannot find symbol
>mcreator_energemBlock mcreator_36 = new mcreator_energemBlock();
>                                        ^
>  symbol:   class mcreator_energemBlock
>  location: class TestEnvironmentMod
>C:\Pylo\MCreator\forge\build\sources\java\mod\mcreator\TestEnvironmentMod.java:145: error: cannot find symbol
>mcreator_animagemBlock mcreator_37 = new mcreator_animagemBlock();
>                                         ^
>  symbol:   class mcreator_animagemBlock
>  location: class TestEnvironmentMod
>C:\Pylo\MCreator\forge\build\sources\java\mod\mcreator\TestEnvironmentMod.java:146: error: cannot find symbol
>mcreator_animagemPickaxe mcreator_38 = new mcreator_animagemPickaxe();
>                                           ^
>  symbol:   class mcreator_animagemPickaxe
>  location: class TestEnvironmentMod
>C:\Pylo\MCreator\forge\build\sources\java\mod\mcreator\TestEnvironmentMod.java:147: error: cannot find symbol
>mcreator_animagemHoe mcreator_39 = new mcreator_animagemHoe();
>                                       ^
>  symbol:   class mcreator_animagemHoe
>  location: class TestEnvironmentMod
>C:\Pylo\MCreator\forge\build\sources\java\mod\mcreator\TestEnvironmentMod.java:148: error: cannot find symbol
>mcreator_animagemArmor mcreator_40 = new mcreator_animagemArmor();
>                                         ^
>  symbol:   class mcreator_animagemArmor
>  location: class TestEnvironmentMod
>C:\Pylo\MCreator\forge\build\sources\java\mod\mcreator\TestEnvironmentMod.java:149: error: cannot find symbol
>mcreator_animagemSword mcreator_41 = new mcreator_animagemSword();
>                                         ^
>  symbol:   class mcreator_animagemSword
>  location: class TestEnvironmentMod
>C:\Pylo\MCreator\forge\build\sources\java\mod\mcreator\TestEnvironmentMod.java:150: error: cannot find symbol
>mcreator_animagemShovel mcreator_42 = new mcreator_animagemShovel();
>                                          ^
>  symbol:   class mcreator_animagemShovel
>  location: class TestEnvironmentMod
>C:\Pylo\MCreator\forge\build\sources\java\mod\mcreator\TestEnvironmentMod.java:151: error: cannot find symbol
>mcreator_animagemAxe mcreator_43 = new mcreator_animagemAxe();
>                                       ^
>  symbol:   class mcreator_animagemAxe
>  location: class TestEnvironmentMod
>C:\Pylo\MCreator\forge\build\sources\java\mod\mcreator\TestEnvironmentMod.java:152: error: cannot find symbol
>mcreator_necroGroundBlock mcreator_44 = new mcreator_necroGroundBlock();
>                                            ^
>  symbol:   class mcreator_necroGroundBlock
>  location: class TestEnvironmentMod
>100 errors
>FAILURE: Build failed with an exception.
>* What went wrong:
>Execution failed for task ':compileJava'.
>> Compilation failed; see the compiler error output for details.
>* Try:
>Run with --stacktrace option to get the stack trace. Run with --info or --debug option to get more log output.
>C:\Pylo\MCreator\forge>
>Task completed with return code 0 in 19722 milliseconds