help

1 post / 0 new
Offline
Last seen: 5 months 16 hours ago
Joined: 06/27/2015 - 13:35
Gems: 0
help

>Executing gradle command: build
>Microsoft Windows [Version 6.3.9600]
>(c) 2013 Microsoft Corporation. T�m haklar� sakl�d�r.
>C:\Pylo>cd forge
>C:\Pylo\forge>SET "JAVA_HOME=C:\Pylo\jdk\"
>C:\Pylo\forge>SET JAVA_EXE=%JAVA_HOME%\bin\java.exe
>C:\Pylo\forge>SET PATH=%JAVA_HOME%\bin\;%PATH%
>C:\Pylo\forge>gradlew build
>****************************
> Powered By MCP:             
> http://mcp.ocean-labs.de/   
> Searge, ProfMobius, Fesh0r, 
> R4wk, ZeuX, IngisKahn, bspkrs
> MCP Data version : unknown
>****************************
>:compileApiJava UP-TO-DATE
>:processApiResources UP-TO-DATE
>:apiClasses UP-TO-DATE
>:sourceMainJava
>:compileJava
>:processResources UP-TO-DATE
>:classes
>:jar
>:compileTestJava UP-TO-DATE
>:processTestResources UP-TO-DATE
>:testClasses UP-TO-DATE
>:test UP-TO-DATE
>:extractMcpData UP-TO-DATE
>:getVersionJson
>:extractUserDev UP-TO-DATE
>:genSrgs SKIPPED
>:reobf FAILED
>FAILURE: Build failed with an exception.
>* What went wrong:
>Execution failed for task ':reobf'.
>BUILD FAILED
>> MALFORMED
>Total time: 12.969 secs
>* Try:
>Run with --stacktrace option to get the stack trace. Run with --info or --debug option to get more log output.
>C:\Pylo\forge>
>Task completed with return code 0 in 13443 milliseconds
>Task return code check OK!
>=========================================================================================================================
>Executing gradle command: build
>Microsoft Windows [Version 6.3.9600]
>(c) 2013 Microsoft Corporation. T�m haklar� sakl�d�r.
>C:\Pylo>cd forge
>C:\Pylo\forge>SET "JAVA_HOME=C:\Pylo\jdk\"
>C:\Pylo\forge>SET JAVA_EXE=%JAVA_HOME%\bin\java.exe
>C:\Pylo\forge>SET PATH=%JAVA_HOME%\bin\;%PATH%
>C:\Pylo\forge>gradlew build
>****************************
> Powered By MCP:             
> http://mcp.ocean-labs.de/   
> Searge, ProfMobius, Fesh0r, 
> R4wk, ZeuX, IngisKahn, bspkrs
> MCP Data version : unknown
>****************************
>:compileApiJava UP-TO-DATE
>:processApiResources UP-TO-DATE
>:apiClasses UP-TO-DATE
>:sourceMainJava
>:compileJava
>:processResources
>:classes
>:jar
>:compileTestJava UP-TO-DATE
>:processTestResources UP-TO-DATE
>:testClasses UP-TO-DATE
>:test UP-TO-DATE
>:extractMcpData UP-TO-DATE
>:getVersionJson
>:extractUserDev UP-TO-DATE
>:genSrgs SKIPPED
>:reobf FAILED
>FAILURE: Build failed with an exception.
>* What went wrong:
>Execution failed for task ':reobf'.
>BUILD FAILED
>> MALFORMED
>* Try:
>Total time: 15.733 secs
>Run with --stacktrace option to get the stack trace. Run with --info or --debug option to get more log output.
>C:\Pylo\forge>
>Task completed with return code 0 in 16195 milliseconds
>Task return code check OK!