Can't export the mod

7 posts / 0 new
Last post
DarkCode's picture
Offline
Last seen: 11 months 1 week ago
Joined: 06/24/2015 - 01:16
Gems: 0
Can't export the mod

Help me, when i export the mod MCreator crashes



ozick625's picture
Offline
Last seen: 1 year 1 month ago
Joined: 05/06/2015 - 17:15
Gems: 0
So some mod has a bug, try to

So some mod has a bug, try to recreate all the mods WITHOUT ERRORS, and the error when exporting should disappear.

xXMCXx's picture
Offline
Last seen: 5 days 16 hours ago
Joined: 12/27/2013 - 21:01
Gems: 378
@DarkCode Well the crash log,

@DarkCode Well the crash log, or the error log in MCreator would be super fantastic so we can actually help you.

retibalt's picture
Offline
Last seen: 9 months 4 days ago
Joined: 06/21/2015 - 02:31
Gems: 0
my help would you delete the

my help would you delete the mcreator for any errors or ever do what it says it has Error

 

Offline
Last seen: 1 year 11 months ago
Joined: 04/24/2015 - 21:07
Gems: 0
Reinstall

Reinstall

DarkCode's picture
Offline
Last seen: 11 months 1 week ago
Joined: 06/24/2015 - 01:16
Gems: 0
>BOOTING UP GRADLE...>Data
>BOOTING UP GRADLE...
>Data loaded, MCreator gradle console ready [ver 1.007]! [boot took 9 milliseconds]
>RIGHT click once to copy log to the clipboard or twice to clear the log.
>=========================================================================================================================
>Executing gradle command: build
>Microsoft Windows [Versione 6.1.7601]
>C:\Pylo\MCreator156>cd forge
>C:\Pylo\MCreator156\forge>SET "JAVA_HOME=C:\Pylo\MCreator156\jdk\"
>C:\Pylo\MCreator156\forge>SET JAVA_EXE=%JAVA_HOME%\bin\java.exe
>C:\Pylo\MCreator156\forge>SET PATH=%JAVA_HOME%\bin\;%PATH%
>C:\Pylo\MCreator156\forge>gradlew build
>****************************
> Powered By MCP:             
> http://mcp.ocean-labs.de/   
> Searge, ProfMobius, Fesh0r, 
> R4wk, ZeuX, IngisKahn, bspkrs
> MCP Data version : unknown
>****************************
>:downloadClient
>FAILURE: Build failed with an exception.
>* What went wrong:
>java.io.FileNotFoundException: C:\Pylo\MCreator156\forge\.gradle\2.0\taskArtifacts\cache.properties (Impossibile trovare il file specificato)
>BUILD FAILED
>> C:\Pylo\MCreator156\forge\.gradle\2.0\taskArtifacts\cache.properties (Impossibile trovare il file specificato)
>* Try:
>Run with --stacktrace option to get the stack trace. Run with --info or --debug option to get more log output.
>Total time: 7.126 secs

This is the log

 

DarkCode's picture
Offline
Last seen: 11 months 1 week ago
Joined: 06/24/2015 - 01:16
Gems: 0
I've resolved.

I've resolved.

I simply renamed cache.properties.lock to cache.properties in the folder C:\Pylo\MCreator156\forge\.gradle\2.0\taskArtifacts