:REOBF ERROR

1 post / 0 new
Boyard21's picture
Offline
Last seen: 1 year 3 months ago
Joined: 06/14/2015 - 15:06
Gems: 0
:REOBF ERROR

When I do something with the mod it recompiles, shows a normal data (compileApiJava Up-To-Date, ProcessResources Up-To-Date etc.) but then it says reobf FAILED.  

>BOOTING UP GRADLE...
>Data loaded, MCreator gradle console ready [ver 1.007]! [boot took 47 milliseconds]
>RIGHT click once to copy log to the clipboard or twice to clear the log.
>=========================================================================================================================
>Executing gradle command: build
>Microsoft Windows [Version 6.3.9600]
>(c) 2013 Microsoft Corporation. Vçechna pr va vyhrazena.
>C:\Users\Boyard\Desktop\Pylo's MCreator 1>cd forge
>C:\Users\Boyard\Desktop\Pylo's MCreator 1\forge>SET "JAVA_HOME=C:\Users\Boyard\Desktop\Pylo's MCreator 1\jdk\"
>C:\Users\Boyard\Desktop\Pylo's MCreator 1\forge>SET JAVA_EXE=%JAVA_HOME%\bin\java.exe
>C:\Users\Boyard\Desktop\Pylo's MCreator 1\forge>SET PATH=%JAVA_HOME%\bin\;%PATH%
>C:\Users\Boyard\Desktop\Pylo's MCreator 1\forge>gradlew build
>****************************
> Powered By MCP:             
> http://mcp.ocean-labs.de/   
> Searge, ProfMobius, Fesh0r, 
> R4wk, ZeuX, IngisKahn, bspkrs
> MCP Data version : unknown
>****************************
>:compileApiJava UP-TO-DATE
>:processApiResources UP-TO-DATE
>:apiClasses UP-TO-DATE
>:sourceMainJava
>:compileJava
>:processResources
>:classes
>:jar
>:compileTestJava UP-TO-DATE
>:processTestResources UP-TO-DATE
>:testClasses UP-TO-DATE
>:test UP-TO-DATE
>:extractMcpData UP-TO-DATE
>:getVersionJson
>:extractUserDev UP-TO-DATE
>:genSrgs SKIPPED
>:reobf FAILED
>FAILURE: Build failed with an exception.
>* What went wrong:
>Execution failed for task ':reobf'.
>BUILD FAILED
>> MALFORMED
>* Try:
>Total time: 11.019 secs
>Run with --stacktrace option to get the stack trace. Run with --info or --debug option to get more log output.
>C:\Users\Boyard\Desktop\Pylo's MCreator 1\forge>
>Task completed with return code 0 in 11831 milliseconds
>Task return code check OK!
>=========================================================================================================================
>Executing gradle command: build
>Microsoft Windows [Version 6.3.9600]
>(c) 2013 Microsoft Corporation. Vçechna pr va vyhrazena.
>C:\Users\Boyard\Desktop\Pylo's MCreator 1>cd forge
>C:\Users\Boyard\Desktop\Pylo's MCreator 1\forge>SET "JAVA_HOME=C:\Users\Boyard\Desktop\Pylo's MCreator 1\jdk\"
>C:\Users\Boyard\Desktop\Pylo's MCreator 1\forge>SET JAVA_EXE=%JAVA_HOME%\bin\java.exe
>C:\Users\Boyard\Desktop\Pylo's MCreator 1\forge>SET PATH=%JAVA_HOME%\bin\;%PATH%
>C:\Users\Boyard\Desktop\Pylo's MCreator 1\forge>gradlew build
>****************************
> Powered By MCP:             
> http://mcp.ocean-labs.de/   
> Searge, ProfMobius, Fesh0r, 
> R4wk, ZeuX, IngisKahn, bspkrs
> MCP Data version : unknown
>****************************
>:compileApiJava UP-TO-DATE
>:processApiResources UP-TO-DATE
>:apiClasses UP-TO-DATE
>:sourceMainJava
>:compileJava
>:processResources UP-TO-DATE
>:classes
>:jar
>:compileTestJava UP-TO-DATE
>:processTestResources UP-TO-DATE
>:testClasses UP-TO-DATE
>:test UP-TO-DATE
>:extractMcpData UP-TO-DATE
>:getVersionJson
>:extractUserDev UP-TO-DATE
>:genSrgs SKIPPED
>:reobf FAILED
>FAILURE: Build failed with an exception.
>* What went wrong:
>Execution failed for task ':reobf'.
>BUILD FAILED
>> MALFORMED
>Total time: 9.403 secs
>* Try:
>Run with --stacktrace option to get the stack trace. Run with --info or --debug option to get more log output.
>C:\Users\Boyard\Desktop\Pylo's MCreator 1\forge>
>Task completed with return code 0 in 10028 milliseconds
>Task return code check OK!