Problems

2 posts / 0 new
Last post
Offline
Last seen: 2 months 4 weeks ago
Joined: 03/12/2015 - 00:21
Gems: 0
Problems

When i look at the gradle task thing, just to check on it i see this alarming log:

 


>C:\Users\Elias Shalom\Desktop\MCreator 1.5.6 [1.7.10]\forge\build\sources\java\mod\mcreator\TestEnvironmentMod.java:114: error: cannot find symbol
>mcreator_bulletShell mcreator_6 = new mcreator_bulletShell();
>^
>  symbol:   class mcreator_bulletShell
>  location: class TestEnvironmentMod
>C:\Users\Elias Shalom\Desktop\MCreator 1.5.6 [1.7.10]\forge\build\sources\java\mod\mcreator\TestEnvironmentMod.java:115: error: cannot find symbol
>mcreator_bullet mcreator_7 = new mcreator_bullet();
>^
>  symbol:   class mcreator_bullet
>  location: class TestEnvironmentMod
>C:\Users\Elias Shalom\Desktop\MCreator 1.5.6 [1.7.10]\forge\build\sources\java\mod\mcreator\TestEnvironmentMod.java:119: error: cannot find symbol
>mcreator_earlyPioneer mcreator_11 = new mcreator_earlyPioneer();
>^
>  symbol:   class mcreator_earlyPioneer
>  location: class TestEnvironmentMod
>C:\Users\Elias Shalom\Desktop\MCreator 1.5.6 [1.7.10]\forge\build\sources\java\mod\mcreator\TestEnvironmentMod.java:114: error: cannot find symbol
>mcreator_bulletShell mcreator_6 = new mcreator_bulletShell();
>                                      ^
>  symbol:   class mcreator_bulletShell
>  location: class TestEnvironmentMod
>C:\Users\Elias Shalom\Desktop\MCreator 1.5.6 [1.7.10]\forge\build\sources\java\mod\mcreator\TestEnvironmentMod.java:115: error: cannot find symbol
>mcreator_bullet mcreator_7 = new mcreator_bullet();
>                                 ^
>  symbol:   class mcreator_bullet
>  location: class TestEnvironmentMod
>C:\Users\Elias Shalom\Desktop\MCreator 1.5.6 [1.7.10]\forge\build\sources\java\mod\mcreator\TestEnvironmentMod.java:119: error: cannot find symbol
>mcreator_earlyPioneer mcreator_11 = new mcreator_earlyPioneer();
>                                        ^
>  symbol:   class mcreator_earlyPioneer
>  location: class TestEnvironmentMod
>C:\Users\Elias Shalom\Desktop\MCreator 1.5.6 [1.7.10]\forge\build\sources\java\mod\mcreator\mcreator_prehistoryWeaponAmmo.java:102: error: cannot find symbol
>                        return mcreator_bullet.block;
>                               ^
>  symbol: variable mcreator_bullet
>7 errors
>:compileJava FAILED
>FAILURE: Build failed with an exception.
>* What went wrong:
>BUILD FAILED
>Execution failed for task ':compileJava'.
>Total time: 22.01 secs
>> Compilation failed; see the compiler error output for details.
>* Try:
>Run with --stacktrace option to get the stack trace. Run with --info or --debug option to get more log output.
>C:\Users\Elias Shalom\Desktop\MCreator 1.5.6 [1.7.10]\forge>



Offline
Last seen: 2 months 4 weeks ago
Joined: 03/12/2015 - 00:21
Gems: 0
Nevermind.. I fixed it.

Nevermind.. I fixed it.