A bug... [Please fix it! >:( ].

1 post / 0 new
Offline
Last seen: 8 months 6 days ago
Joined: 06/15/2015 - 00:25
Gems: 0
A bug... [Please fix it! >:( ].

>BOOTING UP GRADLE...
>Data loaded, MCreator gradle console ready [ver 1.007]! [boot took 5 milliseconds]
>RIGHT click once to copy log to the clipboard or twice to clear the log.
>=========================================================================================================================
>Executing gradle command: runClient
>Microsoft Windows [Version 6.1.7601]
>Copyright (c) 2009 Microsoft Corporation.  All rights reserved.
>C:\Pylo\MCreator156>cd forge
>C:\Pylo\MCreator156\forge>SET "JAVA_HOME=C:\Pylo\MCreator156\jdk\"
>C:\Pylo\MCreator156\forge>SET JAVA_EXE=%JAVA_HOME%\bin\java.exe
>C:\Pylo\MCreator156\forge>SET PATH=%JAVA_HOME%\bin\;%PATH%
>C:\Pylo\MCreator156\forge>gradlew runClient
>****************************
> Powered By MCP:             
> http://mcp.ocean-labs.de/   
> Searge, ProfMobius, Fesh0r, 
> R4wk, ZeuX, IngisKahn, bspkrs
> MCP Data version : unknown
>****************************
>:compileApiJava UP-TO-DATE
>:processApiResources UP-TO-DATE
>:apiClasses UP-TO-DATE
>:sourceMainJava
>C:\Pylo\MCreator156\forge\build\sources\java\mod\mcreator\TestEnvironmentMod.java:110: error: cannot find symbol
>mcreator_adinggot mcreator_2 = new mcreator_adinggot();
>^
>  symbol:   class mcreator_adinggot
>  location: class TestEnvironmentMod
>C:\Pylo\MCreator156\forge\build\sources\java\mod\mcreator\TestEnvironmentMod.java:110: error: cannot find symbol
>mcreator_adinggot mcreator_2 = new mcreator_adinggot();
>                                   ^
>  symbol:   class mcreator_adinggot
>  location: class TestEnvironmentMod
>C:\Pylo\MCreator156\forge\build\sources\java\mod\mcreator\mcreator_itemaduritesword.java:103: error: cannot find symbol
>    "012", "X4X", "X7X", Character.valueOf('0'), new ItemStack(Items.diamond, 1), Character.valueOf('1'), new ItemStack(mcreator_adinggot.block, 1), Character.valueOf('2'), new ItemStack(Items.diamond, 1), Character.valueOf('4'), new ItemStack(mcreator_adinggot.block, 1), Character.valueOf('7'), new ItemStack(mcreator_hydrost.block, 1), 
>                                                                                                                        ^
>  symbol:   variable mcreator_adinggot
>  location: class mcreator_itemaduritesword
>C:\Pylo\MCreator156\forge\build\sources\java\mod\mcreator\mcreator_itemaduritesword.java:103: error: cannot find symbol
>    "012", "X4X", "X7X", Character.valueOf('0'), new ItemStack(Items.diamond, 1), Character.valueOf('1'), new ItemStack(mcreator_adinggot.block, 1), Character.valueOf('2'), new ItemStack(Items.diamond, 1), Character.valueOf('4'), new ItemStack(mcreator_adinggot.block, 1), Character.valueOf('7'), new ItemStack(mcreator_hydrost.block, 1), 
>                                                                                                                                                                                                                                                    ^
>  symbol:   variable mcreator_adinggot
>  location: class mcreator_itemaduritesword
>C:\Pylo\MCreator156\forge\build\sources\java\mod\mcreator\mcreator_adaxe.java:103: error: cannot find symbol
>    "012", "34X", "X7X", Character.valueOf('0'), new ItemStack(mcreator_adinggot.block, 1), Character.valueOf('1'), new ItemStack(mcreator_adinggot.block, 1), Character.valueOf('2'), new ItemStack(Items.diamond, 1), Character.valueOf('3'), new ItemStack(mcreator_adinggot.block, 1), Character.valueOf('4'), new ItemStack(mcreator_hydrost.block, 1), Character.valueOf('7'), new ItemStack(mcreator_hydrost.block, 1), 
>                                                               ^
>  symbol:   variable mcreator_adinggot
>  location: class mcreator_adaxe
>C:\Pylo\MCreator156\forge\build\sources\java\mod\mcreator\mcreator_adaxe.java:103: error: cannot find symbol
>    "012", "34X", "X7X", Character.valueOf('0'), new ItemStack(mcreator_adinggot.block, 1), Character.valueOf('1'), new ItemStack(mcreator_adinggot.block, 1), Character.valueOf('2'), new ItemStack(Items.diamond, 1), Character.valueOf('3'), new ItemStack(mcreator_adinggot.block, 1), Character.valueOf('4'), new ItemStack(mcreator_hydrost.block, 1), Character.valueOf('7'), new ItemStack(mcreator_hydrost.block, 1), 
>                                                                                                                                  ^
>  symbol:   variable mcreator_adinggot
>  location: class mcreator_adaxe
>C:\Pylo\MCreator156\forge\build\sources\java\mod\mcreator\mcreator_adaxe.java:103: error: cannot find symbol
>    "012", "34X", "X7X", Character.valueOf('0'), new ItemStack(mcreator_adinggot.block, 1), Character.valueOf('1'), new ItemStack(mcreator_adinggot.block, 1), Character.valueOf('2'), new ItemStack(Items.diamond, 1), Character.valueOf('3'), new ItemStack(mcreator_adinggot.block, 1), Character.valueOf('4'), new ItemStack(mcreator_hydrost.block, 1), Character.valueOf('7'), new ItemStack(mcreator_hydrost.block, 1), 
>                                                                                                                                                                                                                                                              ^
>  symbol:   variable mcreator_adinggot
>  location: class mcreator_adaxe
>C:\Pylo\MCreator156\forge\build\sources\java\mod\mcreator\mcreator_adpick.java:103: error: cannot find symbol
>    "012", "345", "X7X", Character.valueOf('0'), new ItemStack(mcreator_adinggot.block, 1), Character.valueOf('1'), new ItemStack(mcreator_adinggot.block, 1), Character.valueOf('2'), new ItemStack(mcreator_adinggot.block, 1), Character.valueOf('3'), new ItemStack(Items.diamond, 1), Character.valueOf('4'), new ItemStack(mcreator_hydrost.block, 1), Character.valueOf('5'), new ItemStack(Items.diamond, 1), Character.valueOf('7'), new ItemStack(mcreator_hydrost.block, 1), 
>                                                               ^
>  symbol:   variable mcreator_adinggot
>  location: class mcreator_adpick
>C:\Pylo\MCreator156\forge\build\sources\java\mod\mcreator\mcreator_adpick.java:103: error: cannot find symbol
>    "012", "345", "X7X", Character.valueOf('0'), new ItemStack(mcreator_adinggot.block, 1), Character.valueOf('1'), new ItemStack(mcreator_adinggot.block, 1), Character.valueOf('2'), new ItemStack(mcreator_adinggot.block, 1), Character.valueOf('3'), new ItemStack(Items.diamond, 1), Character.valueOf('4'), new ItemStack(mcreator_hydrost.block, 1), Character.valueOf('5'), new ItemStack(Items.diamond, 1), Character.valueOf('7'), new ItemStack(mcreator_hydrost.block, 1), 
>                                                                                                                                  ^
>  symbol:   variable mcreator_adinggot
>  location: class mcreator_adpick
>C:\Pylo\MCreator156\forge\build\sources\java\mod\mcreator\mcreator_adpick.java:103: error: cannot find symbol
>    "012", "345", "X7X", Character.valueOf('0'), new ItemStack(mcreator_adinggot.block, 1), Character.valueOf('1'), new ItemStack(mcreator_adinggot.block, 1), Character.valueOf('2'), new ItemStack(mcreator_adinggot.block, 1), Character.valueOf('3'), new ItemStack(Items.diamond, 1), Character.valueOf('4'), new ItemStack(mcreator_hydrost.block, 1), Character.valueOf('5'), new ItemStack(Items.diamond, 1), Character.valueOf('7'), new ItemStack(mcreator_hydrost.block, 1), 
>                                                                                                                                                                                                     ^
>  symbol:   variable mcreator_adinggot
>  location: class mcreator_adpick
>:compileJava FAILED
>10 errors
>FAILURE: Build failed with an exception.
>* What went wrong:
>Execution failed for task ':compileJava'.
>> Compilation failed; see the compiler error output for details.
>* Try:
>Run with --stacktrace option to get the stack trace. Run with --info or --debug option to get more log output.
>BUILD FAILED
>Total time: 12.724 secs
>C:\Pylo\MCreator156\forge>
>Task completed with return code 0 in 13411 milliseconds

 

Edited by: koreakid02 on 06/15/2015 - 07:53