I NEED HELP!!!

2 posts / 0 new
Last post
Offline
Last seen: 2 years 2 weeks ago
Joined: 06/05/2015 - 14:54
Gems: 0
I NEED HELP!!!

this sucks. i just delete some element and it failed. im having alot of problems in mcreator specially 1.5.6 stuck at installing forge.
every time i export a mod. i export the previous mod that i created successfully

 

>BOOTING UP GRADLE...
>Data loaded, MCreator gradle console ready [ver 1.007]! [boot took 307 milliseconds]
>RIGHT click once to copy log to the clipboard or twice to clear the log.
>=========================================================================================================================
>Executing gradle command: build
>Microsoft Windows [Version 6.1.7601]
>Copyright (c) 2009 Microsoft Corporation.  All rights reserved.
>C:\Pylo\MCreator155>cd forge
>C:\Pylo\MCreator155\forge>SET "JAVA_HOME=C:\Pylo\MCreator155\jdk\"
>C:\Pylo\MCreator155\forge>SET JAVA_EXE=%JAVA_HOME%\bin\java.exe
>C:\Pylo\MCreator155\forge>SET PATH=%JAVA_HOME%\bin\;%PATH%
>C:\Pylo\MCreator155\forge>gradlew build
>****************************
> Powered By MCP:             
> http://mcp.ocean-labs.de/   
> Searge, ProfMobius, Fesh0r,
> R4wk, ZeuX, IngisKahn, bspkrs
> MCP Data version : unknown
>****************************
>:downloadClient SKIPPED
>:downloadServer SKIPPED
>:getVersionJson
>:extractUserDev
>:mergeJars SKIPPED
>:applyBinPatches
>:downloadMcpTools SKIPPED
>:extractMcpData UP-TO-DATE
>:genSrgs
>:deobfBinJar
>Applying SpecialSource...
>Applying Exceptor...
>Stripping synthetics...
>:compileApiJava UP-TO-DATE
>:processApiResources UP-TO-DATE
>:apiClasses UP-TO-DATE
>:sourceMainJava
>C:\Pylo\MCreator155\forge\build\sources\java\mod\mcreator\TestEnvironmentMod.java:108: error: cannot find symbol
>    mcreator_coal mcreator_0 = new mcreator_coal();
>    ^
>  symbol:   class mcreator_coal
>  location: class TestEnvironmentMod
>C:\Pylo\MCreator155\forge\build\sources\java\mod\mcreator\TestEnvironmentMod.java:109: error: cannot find symbol
>mcreator_green mcreator_1 = new mcreator_green();
>^
>  symbol:   class mcreator_green
>  location: class TestEnvironmentMod
>C:\Pylo\MCreator155\forge\build\sources\java\mod\mcreator\TestEnvironmentMod.java:108: error: cannot find symbol
>    mcreator_coal mcreator_0 = new mcreator_coal();
>                                   ^
>  symbol:   class mcreator_coal
>  location: class TestEnvironmentMod
>C:\Pylo\MCreator155\forge\build\sources\java\mod\mcreator\TestEnvironmentMod.java:109: error: cannot find symbol
>mcreator_green mcreator_1 = new mcreator_green();
>                                ^
>  symbol:   class mcreator_green
>  location: class TestEnvironmentMod
>C:\Pylo\MCreator155\forge\build\sources\java\mod\mcreator\mcreator_banana4th.java:101: error: cannot find symbol
>    "X1X", "X4X", "X7X", Character.valueOf('1'), new ItemStack(mcreator_banana3rd.block, 1), Character.valueOf('4'), new ItemStack(mcreator_banana3rd.block, 1), Character.valueOf('7'), new ItemStack(Items.stick, 1),
>                                                               ^
>  symbol:   variable mcreator_banana3rd
>  location: class mcreator_banana4th
>C:\Pylo\MCreator155\forge\build\sources\java\mod\mcreator\mcreator_banana4th.java:101: error: cannot find symbol
>    "X1X", "X4X", "X7X", Character.valueOf('1'), new ItemStack(mcreator_banana3rd.block, 1), Character.valueOf('4'), new ItemStack(mcreator_banana3rd.block, 1), Character.valueOf('7'), new ItemStack(Items.stick, 1),
>                                                                                                                                   ^
>  symbol:   variable mcreator_banana3rd
>  location: class mcreator_banana4th
>6 errors
>:compileJava FAILED
>FAILURE: Build failed with an exception.
>* What went wrong:
>Execution failed for task ':compileJava'.
>> Compilation failed; see the compiler error output for details.
>* Try:
>Run with --stacktrace option to get the stack trace. Run with --info or --debug option to get more log output.
>BUILD FAILED
>Total time: 2 mins 35.497 secs
>C:\Pylo\MCreator155\forge>
>Task completed with return code 0 in 162395 milliseconds
>=========================================================================================================================
>Executing gradle command: build
>=========================================================================================================================
>Executing gradle command: build
>Microsoft Windows [Version 6.1.7601]
>Copyright (c) 2009 Microsoft Corporation.  All rights reserved.
>C:\Pylo\MCreator155>cd forge
>C:\Pylo\MCreator155\forge>SET "JAVA_HOME=C:\Pylo\MCreator155\jdk\"
>C:\Pylo\MCreator155\forge>SET JAVA_EXE=%JAVA_HOME%\bin\java.exe
>C:\Pylo\MCreator155\forge>SET PATH=%JAVA_HOME%\bin\;%PATH%
>C:\Pylo\MCreator155\forge>gradlew build
>Microsoft Windows [Version 6.1.7601]
>Copyright (c) 2009 Microsoft Corporation.  All rights reserved.
>C:\Pylo\MCreator155>cd forge
>C:\Pylo\MCreator155\forge>SET "JAVA_HOME=C:\Pylo\MCreator155\jdk\"
>C:\Pylo\MCreator155\forge>SET JAVA_EXE=%JAVA_HOME%\bin\java.exe
>C:\Pylo\MCreator155\forge>SET PATH=%JAVA_HOME%\bin\;%PATH%
>C:\Pylo\MCreator155\forge>gradlew build
>****************************
> Powered By MCP:             
> http://mcp.ocean-labs.de/   
> Searge, ProfMobius, Fesh0r,
> R4wk, ZeuX, IngisKahn, bspkrs
> MCP Data version : unknown
>****************************
>:downloadClient SKIPPED
>:downloadServer SKIPPED
>:getVersionJson
>****************************
> Powered By MCP:             
> http://mcp.ocean-labs.de/   
> Searge, ProfMobius, Fesh0r,
> R4wk, ZeuX, IngisKahn, bspkrs
> MCP Data version : unknown
>****************************
>:extractUserDev UP-TO-DATE
>:downloadClient SKIPPED
>:downloadServer SKIPPED
>:mergeJars SKIPPED
>:getVersionJson
>:applyBinPatches SKIPPED
>:downloadMcpTools SKIPPED
>:extractMcpData UP-TO-DATE
>:extractUserDev UP-TO-DATE
>:mergeJars SKIPPED
>:applyBinPatches SKIPPED
>:downloadMcpTools SKIPPED
>:extractMcpData UP-TO-DATE
>:genSrgs SKIPPED
>:genSrgs SKIPPED
>:deobfBinJar SKIPPED
>:deobfBinJar SKIPPED
>:compileApiJava UP-TO-DATE
>:processApiResources UP-TO-DATE
>:apiClasses UP-TO-DATE
>:compileApiJava UP-TO-DATE
>:processApiResources UP-TO-DATE
>:apiClasses UP-TO-DATE
>:sourceMainJava
>:sourceMainJava UP-TO-DATE
>C:\Pylo\MCreator155\forge\build\sources\java\mod\mcreator\mcreator_banana4th.java:101: error: cannot find symbol
>    "X1X", "X4X", "X7X", Character.valueOf('1'), new ItemStack(mcreator_banana3rd.block, 1), Character.valueOf('4'), new ItemStack(mcreator_banana3rd.block, 1), Character.valueOf('7'), new ItemStack(Items.stick, 1),
>                                                               ^
>  symbol:   variable mcreator_banana3rd
>  location: class mcreator_banana4th
>C:\Pylo\MCreator155\forge\build\sources\java\mod\mcreator\mcreator_banana4th.java:101: error: cannot find symbol
>    "X1X", "X4X", "X7X", Character.valueOf('1'), new ItemStack(mcreator_banana3rd.block, 1), Character.valueOf('4'), new ItemStack(mcreator_banana3rd.block, 1), Character.valueOf('7'), new ItemStack(Items.stick, 1),
>                                                                                                                                   ^
>  symbol:   variable mcreator_banana3rd
>  location: class mcreator_banana4th
>:compileJava FAILED
>2 errors
>FAILURE: Build failed with an exception.
>* What went wrong:
>Execution failed for task ':compileJava'.
>> Compilation failed; see the compiler error output for details.
>* Try:
>Run with --stacktrace option to get the stack trace. Run with --info or --debug option to get more log output.
>BUILD FAILED
>Total time: 54.127 secs
>C:\Pylo\MCreator155\forge>
>C:\Pylo\MCreator155\forge\build\sources\java\mod\mcreator\mcreator_banana4th.java:101: error: cannot find symbol
>    "X1X", "X4X", "X7X", Character.valueOf('1'), new ItemStack(mcreator_banana3rd.block, 1), Character.valueOf('4'), new ItemStack(mcreator_banana3rd.block, 1), Character.valueOf('7'), new ItemStack(Items.stick, 1),
>                                                               ^
>  symbol:   variable mcreator_banana3rd
>  location: class mcreator_banana4th
>C:\Pylo\MCreator155\forge\build\sources\java\mod\mcreator\mcreator_banana4th.java:101: error: cannot find symbol
>    "X1X", "X4X", "X7X", Character.valueOf('1'), new ItemStack(mcreator_banana3rd.block, 1), Character.valueOf('4'), new ItemStack(mcreator_banana3rd.block, 1), Character.valueOf('7'), new ItemStack(Items.stick, 1),
>                                                                                                                                   ^
>  symbol:   variable mcreator_banana3rd
>  location: class mcreator_banana4th
>:compileJava FAILED
>2 errors
>FAILURE: Build failed with an exception.
>* What went wrong:
>Execution failed for task ':compileJava'.
>> Compilation failed; see the compiler error output for details.
>* Try:
>Run with --stacktrace option to get the stack trace. Run with --info or --debug option to get more log output.
>BUILD FAILED
>Total time: 55.588 secs
>C:\Pylo\MCreator155\forge>
>Task completed with return code 0 in 59230 milliseconds

 



Offline
Last seen: 1 year 12 months ago
Joined: 06/17/2015 - 01:44
Gems: 0
I really wish the community

I really wish the community was more active... this sucks