varables not working

1 post / 0 new
bearcraft's picture
Offline
Last seen: 1 year 9 months ago
Joined: 04/28/2015 - 16:41
Gems: 0
varables not working
when i set deal damege and set it so it only does it when isvariableFalse (Ive made the variable before this and the gasmaskmask sets it to true) it bring this up?????
 
 
 
 
 
 
 
>=========================================================================================================================
>Executing gradle command: build
>Microsoft Windows [Version 6.3.9600]
>(c) 2013 Microsoft Corporation. All rights reserved.
>C:\Pylo\MCreator156>cd forge
>C:\Pylo\MCreator156\forge>SET "JAVA_HOME=C:\Pylo\MCreator156\jdk\"
>C:\Pylo\MCreator156\forge>SET JAVA_EXE=%JAVA_HOME%\bin\java.exe
>C:\Pylo\MCreator156\forge>SET PATH=%JAVA_HOME%\bin\;%PATH%
>C:\Pylo\MCreator156\forge>gradlew build
>****************************
> Powered By MCP:             
> Searge, ProfMobius, Fesh0r, 
> R4wk, ZeuX, IngisKahn, bspkrs
> MCP Data version : unknown
>****************************
>:compileApiJava UP-TO-DATE
>:processApiResources UP-TO-DATE
>:apiClasses UP-TO-DATE
>:sourceMainJava
>C:\Pylo\MCreator156\forge\build\sources\java\mod\mcreator\mcreator_gas.java:168: error: ']' expected
>if(!mcreator_VarListTestEnvironmentMod.isVariableFalse[gasmask){
>                                                              ^
>1 error
>:compileJava FAILED
>FAILURE: Build failed with an exception.
>* What went wrong:
>Execution failed for task ':compileJava'.
>> Compilation failed; see the compiler error output for details.
>BUILD F>Run with --stacktrace option to get the stack trace. Run with --info or --debug option to get more log output.
AILED
>* Try:
>Total time: 5.886 secs
>C:\Pylo\MCreator156\forge>
>Task completed with return code 0 in 6730 milliseconds