Won't test my mod

6 posts / 0 new
Last post
Offline
Last seen: 1 year 7 months ago
Joined: 05/24/2015 - 22:54
Gems: 0
Won't test my mod

Help! MCreator won't test launch my mod it just says:

>Executing gradle command: runClient
>Microsoft Windows [Version 6.3.9600]
>(c) 2013 Microsoft Corporation. All rights reserved.
>C:\Pylo\MCreator156>cd forge
>C:\Pylo\MCreator156\forge>SET "JAVA_HOME=C:\Pylo\MCreator156\jdk\"
>C:\Pylo\MCreator156\forge>SET JAVA_EXE=%JAVA_HOME%\bin\java.exe
>C:\Pylo\MCreator156\forge>SET PATH=%JAVA_HOME%\bin\;%PATH%
>C:\Pylo\MCreator156\forge>gradlew runClient
>****************************
> Powered By MCP:             
> Searge, ProfMobius, Fesh0r, 
> R4wk, ZeuX, IngisKahn, bspkrs
> MCP Data version : unknown
>****************************
>:downloadClient SKIPPED
>:downloadServer SKIPPED
>:getVersionJson
>:extractUserDev
>FAILURE: Build failed with an exception.
>* What went wrong:
>java.io.FileNotFoundException: C:\Pylo\MCreator156\forge\.gradle\2.0\taskArtifacts\cache.properties (The system cannot find the file specified)
>> C:\Pylo\MCreator156\forge\.gradle\2.0\taskArtifacts\cache.properties (The system cannot find the file specified)
>BUILD FAILED
>* Try:
>Total time: 10.205 secs
>Run with --stacktrace option to get the stack trace. Run with --info or --debug option to get more log output.
>C:\Pylo\MCreator156\forge>
>Task completed with return code 0 in 10961 milliseconds
>Task return code check OK!


Offline
Last seen: 1 year 7 months ago
Joined: 05/24/2015 - 20:25
Gems: 0
Same error here

Same error here

Offline
Last seen: 1 year 10 months ago
Joined: 06/26/2015 - 22:16
Gems: 0
anyone know a quick fix

anyone know a quick fix

Offline
Last seen: 1 year 10 months ago
Joined: 06/26/2015 - 22:16
Gems: 0
now i do 

now i do 

ok so here is what you have to do open up the folder C:\pylo\MCreator156\forge\.gradle\2.0\taskArtifacts\                                  what you have to do now is copy not cut the cache.properties.lock file

when you have pasted it rename it to cache.properties 

warning this may vary from version to version

ta dah

Offline
Last seen: 8 months 1 week ago
Joined: 09/18/2016 - 02:02
Gems: 2
RE:now i do 

@Zhacker Mine came that way and it still won't work. It just says:

 

another gradle process is already running. Please try again

Offline
Last seen: 8 months 1 week ago
Joined: 09/18/2016 - 02:02
Gems: 2
nvm. I figured it out.

nvm. I figured it out.