Cannot find the file specified

2 posts / 0 new
Last post
Offline
Last seen: 2 years 3 months ago
Joined: 05/22/2015 - 05:05
Gems: 0
Cannot find the file specified

Ok so I can't run the test environment. I keep getting an error that says cannot find the file specified.

Here is everything i keep getting

>Executing gradle command: runClient
>Microsoft Windows [Version 6.2.9200]
>(c) 2012 Microsoft Corporation. All rights reserved.
>C:\Pylo\MCreator156>cd forge
>C:\Pylo\MCreator156\forge>SET "JAVA_HOME=C:\Pylo\MCreator156\jdk\"
>C:\Pylo\MCreator156\forge>SET JAVA_EXE=%JAVA_HOME%\bin\java.exe
>C:\Pylo\MCreator156\forge>SET PATH=%JAVA_HOME%\bin\;%PATH%
>C:\Pylo\MCreator156\forge>gradlew runClient
>****************************
> Powered By MCP:             
> http://mcp.ocean-labs.de/   
> Searge, ProfMobius, Fesh0r,
> R4wk, ZeuX, IngisKahn, bspkrs
> MCP Data version : unknown
>****************************
>:compileApiJava UP-TO-DATE
>:processApiResources UP-TO-DATE
>:apiClasses UP-TO-DATE
>:sourceMainJava
>FAILURE: Build failed with an exception.
>* What went wrong:
>java.io.FileNotFoundException: C:\Pylo\MCreator156\forge\.gradle\2.0\taskArtifacts\cache.properties (The system cannot find the file specified)
>> C:\Pylo\MCreator156\forge\.gradle\2.0\taskArtifacts\cache.properties (The system cannot find the file specified)
>* Try:
>Run with --stacktrace option to get the stack trace. Run with --info or --debug option to get more log output.
>BUILD FAILED
>Total time: 17.815 secs
>C:\Pylo\MCreator156\forge>
>Task completed with return code 0 in 18721 milliseconds
>Task return code check OK!
>=========================================================================================================================
>Executing gradle command: build
>Microsoft Windows [Version 6.2.9200]
>(c) 2012 Microsoft Corporation. All rights reserved.
>C:\Pylo\MCreator156>cd forge
>C:\Pylo\MCreator156\forge>SET "JAVA_HOME=C:\Pylo\MCreator156\jdk\"
>C:\Pylo\MCreator156\forge>SET JAVA_EXE=%JAVA_HOME%\bin\java.exe
>C:\Pylo\MCreator156\forge>SET PATH=%JAVA_HOME%\bin\;%PATH%
>C:\Pylo\MCreator156\forge>gradlew build
>****************************
> Powered By MCP:             
> http://mcp.ocean-labs.de/   
> Searge, ProfMobius, Fesh0r,
> R4wk, ZeuX, IngisKahn, bspkrs
> MCP Data version : unknown
>****************************
>:compileApiJava UP-TO-DATE
>:processApiResources UP-TO-DATE
>:apiClasses UP-TO-DATE
>:sourceMainJava
>FAILURE: Build failed with an exception.
>* What went wrong:
>BUILD FAILED
>java.io.FileNotFoundException: C:\Pylo\MCreator156\forge\.gradle\2.0\taskArtifacts\cache.properties (The system cannot find the file specified)
>> C:\Pylo\MCreator156\forge\.gradle\2.0\taskArtifacts\cache.properties (The system cannot find the file specified)
>* Try:
>Run with --stacktrace option to get the stack trace. Run with --info or --debug option to get more log output.
>Total time: 18.657 secs
>C:\Pylo\MCreator156\forge>
>Task completed with return code 0 in 20140 milliseconds
>Task return code check OK!



Offline
Last seen: 1 year 10 months ago
Joined: 04/19/2015 - 22:00
Gems: 0
I keep getting that too, I

I keep getting that too, I have no idea how to fix it.