Help forge gradle error

2 posts / 0 new
Last post
Offline
Last seen: 1 year 1 month ago
Joined: 05/06/2015 - 02:18
Gems: 0
Help forge gradle error
FAILURE: Build failed with an exception.
 
* Where:
Build file 'C:\Pylo\MCreator156\forge\build.gradle' line: 18
 
* What went wrong:
A problem occurred evaluating root project 'forge'.
> java.io.EOFException: End of input at line 8413 column 11
 
* Try:
Run with --stacktrace option to get the stack trace. Run with --info or --debug option to get more log output.
 
BUILD FAILED
 
Total time: 15.265 secs
 
Edited by: MrRm1000 on 05/07/2015 - 02:33


Offline
Last seen: 1 year 7 months ago
Joined: 12/17/2014 - 20:53
Gems: 0
Same here...

Same here...