Another error

1 post / 0 new
GH127's picture
Offline
Last seen: 5 months 3 weeks ago
Joined: 01/16/2015 - 19:00
Gems: -1
Another error

Its my second error in a row with mcreator,but now with the 1.5.6 version.When I try to "start test Miecraft client environment" I got this:

ALREADY FIXED

>Executing gradle command: runClien
>Microsoft Windows [versÆo 6.1.7601]
>Copyright (c) 2009 Microsoft Corporation. Todos os direitos reservados.
>C:\Users\Pai\Desktop\MCreator156>cd forge
>C:\Users\Pai\Desktop\MCreator156\forge>SET "JAVA_HOME=C:\Users\Pai\Desktop\MCreator156\jdk\"
>C:\Users\Pai\Desktop\MCreator156\forge>SET JAVA_EXE=%JAVA_HOME%\bin\java.exe
>C:\Users\Pai\Desktop\MCreator156\forge>SET PATH=%JAVA_HOME%\bin\;%PATH%
>C:\Users\Pai\Desktop\MCreator156\forge>gradlew runClient
>java.net.UnknownHostException: export.mcpbot.bspk.rs
> at java.net.AbstractPlainSocketImpl.connect(AbstractPlainSocketImpl.java:178)
> at java.net.PlainSocketImpl.connect(PlainSocketImpl.java:172)
> at java.net.SocksSocketImpl.connect(SocksSocketImpl.java:392)
> at java.net.Socket.connect(Socket.java:579)
> at java.net.Socket.connect(Socket.java:528)
> at sun.net.NetworkClient.doConnect(NetworkClient.java:180)
> at sun.net.www.http.HttpClient.openServer(HttpClient.java:432)
> at sun.net.www.http.HttpClient.openServer(HttpClient.java:527)
> at sun.net.www.http.HttpClient.<init>(HttpClient.java:211)
> at sun.net.www.http.HttpClient.New(HttpClient.java:308)
> at sun.net.www.http.HttpClient.New(HttpClient.java:326)
> at sun.net.www.protocol.http.HttpURLConnection.getNewHttpClient(HttpURLConnection.java:996)
> at sun.net.www.protocol.http.HttpURLConnection.plainConnect(HttpURLConnection.java:932)
> at sun.net.www.protocol.http.HttpURLConnection.connect(HttpURLConnection.java:850)
> at net.minecraftforge.gradle.common.BasePlugin.getWithEtag(BasePlugin.java:469)
> at net.minecraftforge.gradle.common.BasePlugin.setVersionInfoJson(BasePlugin.java:170)
> at net.minecraftforge.gradle.common.BasePlugin.apply(BasePlugin.java:112)
> at net.minecraftforge.gradle.common.BasePlugin.apply(BasePlugin.java:49)
> at org.gradle.api.internal.plugins.DefaultPluginContainer.providePlugin(DefaultPluginContainer.java:110)
> at org.gradle.api.internal.plugins.DefaultPluginContainer.addPluginInternal(DefaultPluginContainer.java:69)
> at org.gradle.api.internal.plugins.DefaultPluginContainer.apply(DefaultPluginContainer.java:35)
> at org.gradle.api.internal.plugins.DefaultObjectConfigurationAction.applyPlugin(DefaultObjectConfigurationAction.java:117)
> at org.gradle.api.internal.plugins.DefaultObjectConfigurationAction.access$200(DefaultObjectConfigurationAction.java:36)
> at org.gradle.api.internal.plugins.DefaultObjectConfigurationAction$3.run(DefaultObjectConfigurationAction.java:85)
> at org.gradle.api.internal.plugins.DefaultObjectConfigurationAction.execute(DefaultObjectConfigurationAction.java:130)
> at org.gradle.api.internal.project.AbstractPluginAware.apply(AbstractPluginAware.java:41)
> at org.gradle.api.Project$apply$0.call(Unknown Source)
> at org.codehaus.groovy.runtime.callsite.CallSiteArray.defaultCall(CallSiteArray.java:45)
> at org.codehaus.groovy.runtime.callsite.AbstractCallSite.call(AbstractCallSite.java:108)
> at org.codehaus.groovy.runtime.callsite.AbstractCallSite.call(AbstractCallSite.java:116)
> at org.gradle.api.internal.project.ProjectScript.apply(ProjectScript.groovy:34)
> at org.gradle.api.Script$apply$0.callCurrent(Unknown Source)
> at org.codehaus.groovy.runtime.callsite.CallSiteArray.defaultCallCurrent(CallSiteArray.java:49)
> at org.codehaus.groovy.runtime.callsite.AbstractCallSite.callCurrent(AbstractCallSite.java:133)
> at org.codehaus.groovy.runtime.callsite.AbstractCallSite.callCurrent(AbstractCallSite.java:141)
> at build_6mpjdqg6c7r5ceapuh6mqarntm.run(C:\Users\Pai\Desktop\MCreator156\forge\build.gradle:18)
> at org.gradle.groovy.scripts.internal.DefaultScriptRunnerFactory$ScriptRunnerImpl.run(DefaultScriptRunnerFactory.java:52)
> at org.gradle.configuration.DefaultScriptPluginFactory$ScriptPluginImpl.apply(DefaultScriptPluginFactory.java:187)
> at org.gradle.configuration.project.BuildScriptProcessor.execute(BuildScriptProcessor.java:39)
> at org.gradle.configuration.project.BuildScriptProcessor.execute(BuildScriptProcessor.java:26)
> at org.gradle.configuration.project.ConfigureActionsProjectEvaluator.evaluate(ConfigureActionsProjectEvaluator.java:34)
> at org.gradle.configuration.project.LifecycleProjectEvaluator.evaluate(LifecycleProjectEvaluator.java:55)
> at org.gradle.api.internal.project.AbstractProject.evaluate(AbstractProject.java:470)
> at org.gradle.api.internal.project.AbstractProject.evaluate(AbstractProject.java:79)
> at org.gradle.configuration.DefaultBuildConfigurer.configure(DefaultBuildConfigurer.java:31)
> at org.gradle.initialization.DefaultGradleLauncher.doBuildStages(DefaultGradleLauncher.java:128)
> at org.gradle.initialization.DefaultGradleLauncher.doBuild(DefaultGradleLauncher.java:105)
> at org.gradle.initialization.DefaultGradleLauncher.run(DefaultGradleLauncher.java:85)
> at org.gradle.launcher.exec.InProcessBuildActionExecuter$DefaultBuildController.run(InProcessBuildActionExecuter.java:81)
> at org.gradle.launcher.cli.ExecuteBuildAction.run(ExecuteBuildAction.java:33)
> at org.gradle.launcher.cli.ExecuteBuildAction.run(ExecuteBuildAction.java:24)
> at org.gradle.launcher.exec.InProcessBuildActionExecuter.execute(InProcessBuildActionExecuter.java:39)
> at org.gradle.launcher.exec.InProcessBuildActionExecuter.execute(InProcessBuildActionExecuter.java:29)
> at org.gradle.launcher.cli.RunBuildAction.run(RunBuildAction.java:50)
> at org.gradle.internal.Actions$RunnableActionAdapter.execute(Actions.java:171)
> at org.gradle.launcher.cli.CommandLineActionFactory$ParseAndBuildAction.execute(CommandLineActionFactory.java:237)
> at org.gradle.launcher.cli.CommandLineActionFactory$ParseAndBuildAction.execute(CommandLineActionFactory.java:210)
> at org.gradle.launcher.cli.JavaRuntimeValidationAction.execute(JavaRuntimeValidationAction.java:35)
> at org.gradle.launcher.cli.JavaRuntimeValidationAction.execute(JavaRuntimeValidationAction.java:24)
> at org.gradle.launcher.cli.CommandLineActionFactory$WithLogging.execute(CommandLineActionFactory.java:206)
> at org.gradle.launcher.cli.CommandLineActionFactory$WithLogging.execute(CommandLineActionFactory.java:169)
> at org.gradle.launcher.cli.ExceptionReportingAction.execute(ExceptionReportingAction.java:33)
> at org.gradle.launcher.cli.ExceptionReportingAction.execute(ExceptionReportingAction.java:22)
> at org.gradle.launcher.Main.doAction(Main.java:33)
> at org.gradle.launcher.bootstrap.EntryPoint.run(EntryPoint.java:45)
> at sun.reflect.NativeMethodAccessorImpl.invoke0(Native Method)
> at sun.reflect.NativeMethodAccessorImpl.invoke(NativeMethodAccessorImpl.java:57)
> at sun.reflect.DelegatingMethodAccessorImpl.invoke(DelegatingMethodAccessorImpl.java:43)
> at java.lang.reflect.Method.invoke(Method.java:606)
> at org.gradle.launcher.bootstrap.ProcessBootstrap.runNoExit(ProcessBootstrap.java:54)
> at org.gradle.launcher.bootstrap.ProcessBootstrap.run(ProcessBootstrap.java:35)
> at org.gradle.launcher.GradleMain.main(GradleMain.java:23)
> at sun.reflect.NativeMethodAccessorImpl.invoke0(Native Method)
> at sun.reflect.NativeMethodAccessorImpl.invoke(NativeMethodAccessorImpl.java:57)
> at sun.reflect.DelegatingMethodAccessorImpl.invoke(DelegatingMethodAccessorImpl.java:43)
> at java.lang.reflect.Method.invoke(Method.java:606)
> at org.gradle.wrapper.BootstrapMainStarter.start(BootstrapMainStarter.java:30)
> at org.gradle.wrapper.WrapperExecutor.execute(WrapperExecutor.java:127)
> at org.gradle.wrapper.GradleWrapperMain.main(GradleWrapperMain.java:56)
>BUILD FAILED
>Total time: 14.962 secs
>FAILURE: Build failed with an exception.
>* Where:
>Build file 'C:\Users\Pai\Desktop\MCreator156\forge\build.gradle' line: 18
>* What went wrong:
>A problem occurred evaluating root project 'forge'.
>> Unable to obtain url (http://export.mcpbot.bspk.rs/versions.json) with etag!
>* Try:
>Run with --stacktrace option to get the stack trace. Run with --info or --debug option to get more log output.
>C:\Users\Pai\Desktop\MCreator156\forge>
>Task completed with return code 0 in 16210 milliseconds
>Task return code check OK!
 ------------------------------------------------------------------------------------------------------------------------------------------------------------
 
Please help me! I rly want to make my second mod!!!
ALREADY FIXED
Edited by: GH127 on 05/03/2015 - 18:34