Cannot create mobs that open doors.

4 posts / 0 new
Last post
Offline
Last seen: 11 months 3 weeks ago
Joined: 03/01/2015 - 03:21
Gems: 0
Cannot create mobs that open doors.

Compilation fails when I try. Here's what I get:

<code>

Executing gradle command: build
Microsoft Windows [Version 10.0.10049]
(c) 2015 Microsoft Corporation. All rights reserved.
C:\Pylo\MCreator155>cd forge
C:\Pylo\MCreator155\forge>SET "JAVA_HOME=C:\Pylo\MCreator155\jdk\"
C:\Pylo\MCreator155\forge>SET JAVA_EXE=%JAVA_HOME%\bin\java.exe
C:\Pylo\MCreator155\forge>SET PATH=%JAVA_HOME%\bin\;%PATH%
C:\Pylo\MCreator155\forge>gradlew build
****************************
 Powered By MCP:             
 http://mcp.ocean-labs.de/   
 Searge, ProfMobius, Fesh0r,
 R4wk, ZeuX, IngisKahn, bspkrs
 MCP Data version : unknown
****************************
:compileApiJava UP-TO-DATE
:processApiResources UP-TO-DATE
:apiClasses UP-TO-DATE
:sourceMainJava
C:\Pylo\MCreator155\forge\build\sources\java\mod\mcreator\mcreator_herobrineTier1.java:151: error: EntityAIDoorInteract is abstract; cannot be instantiated
this.tasks.addTask(1, new EntityAIDoorInteract(this));
                      ^
1 error
:compileJava FAILED
FAILURE: Build failed with an exception.
* What went wrong:
Execution failed for task ':compileJava'.
 Compilation failed; see the compiler error output for details.
* Try:
Run with --stacktrace option to get the stack trace. Run with --info or --debug option to get more log output.
BUILD FAILED
Total time: 49.62 secs
C:\Pylo\MCreator155\forge>
Task completed with return code 0 in 52161 milliseconds

</code>

Edited by: FateForWindows on 04/26/2015 - 16:52


Offline
Last seen: 11 months 3 weeks ago
Joined: 03/01/2015 - 03:21
Gems: 0
Getting a stack trace right

Getting a stack trace right now.

Offline
Last seen: 11 months 3 weeks ago
Joined: 03/01/2015 - 03:21
Gems: 0
Stack trace:

Stack trace:
>* Exception is:
>org.gradle.api.tasks.TaskExecutionException: Execution failed for task ':compileJava'.
> at org.gradle.api.internal.tasks.execution.ExecuteActionsTaskExecuter.executeActions(ExecuteActionsTaskExecuter.java:69)
> at org.gradle.api.internal.tasks.execution.ExecuteActionsTaskExecuter.execute(ExecuteActionsTaskExecuter.java:46)
> at org.gradle.api.internal.tasks.execution.PostExecutionAnalysisTaskExecuter.execute(PostExecutionAnalysisTaskExecuter.java:35)
> at org.gradle.api.internal.tasks.execution.SkipUpToDateTaskExecuter.execute(SkipUpToDateTaskExecuter.java:64)
> at org.gradle.api.internal.tasks.execution.ValidatingTaskExecuter.execute(ValidatingTaskExecuter.java:58)
> at org.gradle.api.internal.tasks.execution.SkipEmptySourceFilesTaskExecuter.execute(SkipEmptySourceFilesTaskExecuter.java:42)
> at org.gradle.api.internal.tasks.execution.SkipTaskWithNoActionsExecuter.execute(SkipTaskWithNoActionsExecuter.java:52)
> at org.gradle.api.internal.tasks.execution.SkipOnlyIfTaskExecuter.execute(SkipOnlyIfTaskExecuter.java:53)
> at org.gradle.api.internal.tasks.execution.ExecuteAtMostOnceTaskExecuter.execute(ExecuteAtMostOnceTaskExecuter.java:43)
> at org.gradle.api.internal.AbstractTask.executeWithoutThrowingTaskFailure(AbstractTask.java:296)
> at org.gradle.execution.taskgraph.AbstractTaskPlanExecutor$TaskExecutorWorker.executeTask(AbstractTaskPlanExecutor.java:79)
> at org.gradle.execution.taskgraph.AbstractTaskPlanExecutor$TaskExecutorWorker.processTask(AbstractTaskPlanExecutor.java:63)
> at org.gradle.execution.taskgraph.AbstractTaskPlanExecutor$TaskExecutorWorker.run(AbstractTaskPlanExecutor.java:51)
> at org.gradle.execution.taskgraph.DefaultTaskPlanExecutor.process(DefaultTaskPlanExecutor.java:23)
> at org.gradle.execution.taskgraph.DefaultTaskGraphExecuter.execute(DefaultTaskGraphExecuter.java:86)
> at org.gradle.execution.SelectedTaskExecutionAction.execute(SelectedTaskExecutionAction.java:29)
> at org.gradle.execution.DefaultBuildExecuter.execute(DefaultBuildExecuter.java:61)
> at org.gradle.execution.DefaultBuildExecuter.access$200(DefaultBuildExecuter.java:23)
> at org.gradle.execution.DefaultBuildExecuter$2.proceed(DefaultBuildExecuter.java:67)
> at org.gradle.execution.DryRunBuildExecutionAction.execute(DryRunBuildExecutionAction.java:32)
> at org.gradle.execution.DefaultBuildExecuter.execute(DefaultBuildExecuter.java:61)
> at org.gradle.execution.DefaultBuildExecuter.execute(DefaultBuildExecuter.java:54)
> at org.gradle.initialization.DefaultGradleLauncher.doBuildStages(DefaultGradleLauncher.java:148)
> at org.gradle.initialization.DefaultGradleLauncher.doBuild(DefaultGradleLauncher.java:105)
> at org.gradle.initialization.DefaultGradleLauncher.run(DefaultGradleLauncher.java:85)
> at org.gradle.launcher.exec.InProcessBuildActionExecuter$DefaultBuildController.run(InProcessBuildActionExecuter.java:81)
> at org.gradle.launcher.cli.ExecuteBuildAction.run(ExecuteBuildAction.java:33)
> at org.gradle.launcher.cli.ExecuteBuildAction.run(ExecuteBuildAction.java:24)
> at org.gradle.launcher.exec.InProcessBuildActionExecuter.execute(InProcessBuildActionExecuter.java:39)
> at org.gradle.launcher.exec.InProcessBuildActionExecuter.execute(InProcessBuildActionExecuter.java:29)
> at org.gradle.launcher.cli.RunBuildAction.run(RunBuildAction.java:50)
> at org.gradle.internal.Actions$RunnableActionAdapter.execute(Actions.java:171)
> at org.gradle.launcher.cli.CommandLineActionFactory$ParseAndBuildAction.execute(CommandLineActionFactory.java:237)
> at org.gradle.launcher.cli.CommandLineActionFactory$ParseAndBuildAction.execute(CommandLineActionFactory.java:210)
> at org.gradle.launcher.cli.JavaRuntimeValidationAction.execute(JavaRuntimeValidationAction.java:35)
> at org.gradle.launcher.cli.JavaRuntimeValidationAction.execute(JavaRuntimeValidationAction.java:24)
> at org.gradle.launcher.cli.CommandLineActionFactory$WithLogging.execute(CommandLineActionFactory.java:206)
> at org.gradle.launcher.cli.CommandLineActionFactory$WithLogging.execute(CommandLineActionFactory.java:169)
> at org.gradle.launcher.cli.ExceptionReportingAction.execute(ExceptionReportingAction.java:33)
> at org.gradle.launcher.cli.ExceptionReportingAction.execute(ExceptionReportingAction.java:22)
> at org.gradle.launcher.Main.doAction(Main.java:33)
> at org.gradle.launcher.bootstrap.EntryPoint.run(EntryPoint.java:45)
> at org.gradle.launcher.bootstrap.ProcessBootstrap.runNoExit(ProcessBootstrap.java:54)
> at org.gradle.launcher.bootstrap.ProcessBootstrap.run(ProcessBootstrap.java:35)
> at org.gradle.launcher.GradleMain.main(GradleMain.java:23)
> at org.gradle.wrapper.BootstrapMainStarter.start(BootstrapMainStarter.java:30)
> at org.gradle.wrapper.WrapperExecutor.execute(WrapperExecutor.java:127)
> at org.gradle.wrapper.GradleWrapperMain.main(GradleWrapperMain.java:56)
>Caused by: org.gradle.api.internal.tasks.compile.CompilationFailedException: Compilation failed; see the compiler error output for details.
> at org.gradle.api.internal.tasks.compile.jdk6.Jdk6JavaCompiler.execute(Jdk6JavaCompiler.java:47)
> at org.gradle.api.internal.tasks.compile.jdk6.Jdk6JavaCompiler.execute(Jdk6JavaCompiler.java:38)
> at org.gradle.api.internal.tasks.compile.NormalizingJavaCompiler.delegateAndHandleErrors(NormalizingJavaCompiler.java:96)
> at org.gradle.api.internal.tasks.compile.NormalizingJavaCompiler.execute(NormalizingJavaCompiler.java:49)
> at org.gradle.api.internal.tasks.compile.NormalizingJavaCompiler.execute(NormalizingJavaCompiler.java:35)
> at org.gradle.api.internal.tasks.compile.DelegatingJavaCompiler.execute(DelegatingJavaCompiler.java:29)
> at org.gradle.api.internal.tasks.compile.DelegatingJavaCompiler.execute(DelegatingJavaCompiler.java:20)
> at org.gradle.api.internal.tasks.compile.CleaningJavaCompilerSupport.execute(CleaningJavaCompilerSupport.java:33)
> at org.gradle.api.internal.tasks.compile.CleaningJavaCompilerSupport.execute(CleaningJavaCompilerSupport.java:24)
> at org.gradle.api.tasks.compile.JavaCompile.performCompilation(JavaCompile.java:87)
> at org.gradle.api.tasks.compile.JavaCompile.compile(JavaCompile.java:65)
> at org.gradle.api.tasks.compile.JavaCompile.compile(JavaCompile.java:53)
> at org.gradle.internal.reflect.JavaMethod.invoke(JavaMethod.java:63)
> at org.gradle.api.internal.project.taskfactory.AnnotationProcessingTaskFactory$IncrementalTaskAction.doExecute(AnnotationProcessingTaskFactory.java:235)
> at org.gradle.api.internal.project.taskfactory.AnnotationProcessingTaskFactory$StandardTaskAction.execute(AnnotationProcessingTaskFactory.java:211)
> at org.gradle.api.internal.project.taskfactory.AnnotationProcessingTaskFactory$IncrementalTaskAction.execute(AnnotationProcessingTaskFactory.java:222)
> at org.gradle.api.internal.project.taskfactory.AnnotationProcessingTaskFactory$StandardTaskAction.execute(AnnotationProcessingTaskFactory.java:200)
> at org.gradle.api.internal.tasks.execution.ExecuteActionsTaskExecuter.executeAction(ExecuteActionsTaskExecuter.java:80)
> at org.gradle.api.internal.tasks.execution.Ex

Offline
Last seen: 11 months 3 weeks ago
Joined: 03/01/2015 - 03:21
Gems: 0
Some of it was cut out.

Some of it was cut out.
>* Exception is:
>org.gradle.api.tasks.TaskExecutionException: Execution failed for task ':compileJava'.
> at org.gradle.api.internal.tasks.execution.ExecuteActionsTaskExecuter.executeActions(ExecuteActionsTaskExecuter.java:69)
> at org.gradle.api.internal.tasks.execution.ExecuteActionsTaskExecuter.execute(ExecuteActionsTaskExecuter.java:46)
> at org.gradle.api.internal.tasks.execution.PostExecutionAnalysisTaskExecuter.execute(PostExecutionAnalysisTaskExecuter.java:35)
> at org.gradle.api.internal.tasks.execution.SkipUpToDateTaskExecuter.execute(SkipUpToDateTaskExecuter.java:64)
> at org.gradle.api.internal.tasks.execution.ValidatingTaskExecuter.execute(ValidatingTaskExecuter.java:58)
> at org.gradle.api.internal.tasks.execution.SkipEmptySourceFilesTaskExecuter.execute(SkipEmptySourceFilesTaskExecuter.java:42)
> at org.gradle.api.internal.tasks.execution.SkipTaskWithNoActionsExecuter.execute(SkipTaskWithNoActionsExecuter.java:52)
> at org.gradle.api.internal.tasks.execution.SkipOnlyIfTaskExecuter.execute(SkipOnlyIfTaskExecuter.java:53)
> at org.gradle.api.internal.tasks.execution.ExecuteAtMostOnceTaskExecuter.execute(ExecuteAtMostOnceTaskExecuter.java:43)
> at org.gradle.api.internal.AbstractTask.executeWithoutThrowingTaskFailure(AbstractTask.java:296)
> at org.gradle.execution.taskgraph.AbstractTaskPlanExecutor$TaskExecutorWorker.executeTask(AbstractTaskPlanExecutor.java:79)
> at org.gradle.execution.taskgraph.AbstractTaskPlanExecutor$TaskExecutorWorker.processTask(AbstractTaskPlanExecutor.java:63)
> at org.gradle.execution.taskgraph.AbstractTaskPlanExecutor$TaskExecutorWorker.run(AbstractTaskPlanExecutor.java:51)
> at org.gradle.execution.taskgraph.DefaultTaskPlanExecutor.process(DefaultTaskPlanExecutor.java:23)
> at org.gradle.execution.taskgraph.DefaultTaskGraphExecuter.execute(DefaultTaskGraphExecuter.java:86)
> at org.gradle.execution.SelectedTaskExecutionAction.execute(SelectedTaskExecutionAction.java:29)
> at org.gradle.execution.DefaultBuildExecuter.execute(DefaultBuildExecuter.java:61)
> at org.gradle.execution.DefaultBuildExecuter.access$200(DefaultBuildExecuter.java:23)
> at org.gradle.execution.DefaultBuildExecuter$2.proceed(DefaultBuildExecuter.java:67)
> at org.gradle.execution.DryRunBuildExecutionAction.execute(DryRunBuildExecutionAction.java:32)
> at org.gradle.execution.DefaultBuildExecuter.execute(DefaultBuildExecuter.java:61)
> at org.gradle.execution.DefaultBuildExecuter.execute(DefaultBuildExecuter.java:54)
> at org.gradle.initialization.DefaultGradleLauncher.doBuildStages(DefaultGradleLauncher.java:148)
> at org.gradle.initialization.DefaultGradleLauncher.doBuild(DefaultGradleLauncher.java:105)
> at org.gradle.initialization.DefaultGradleLauncher.run(DefaultGradleLauncher.java:85)
> at org.gradle.launcher.exec.InProcessBuildActionExecuter$DefaultBuildController.run(InProcessBuildActionExecuter.java:81)
> at org.gradle.launcher.cli.ExecuteBuildAction.run(ExecuteBuildAction.java:33)
> at org.gradle.launcher.cli.ExecuteBuildAction.run(ExecuteBuildAction.java:24)
> at org.gradle.launcher.exec.InProcessBuildActionExecuter.execute(InProcessBuildActionExecuter.java:39)
> at org.gradle.launcher.exec.InProcessBuildActionExecuter.execute(InProcessBuildActionExecuter.java:29)
> at org.gradle.launcher.cli.RunBuildAction.run(RunBuildAction.java:50)
> at org.gradle.internal.Actions$RunnableActionAdapter.execute(Actions.java:171)
> at org.gradle.launcher.cli.CommandLineActionFactory$ParseAndBuildAction.execute(CommandLineActionFactory.java:237)
> at org.gradle.launcher.cli.CommandLineActionFactory$ParseAndBuildAction.execute(CommandLineActionFactory.java:210)
> at org.gradle.launcher.cli.JavaRuntimeValidationAction.execute(JavaRuntimeValidationAction.java:35)
> at org.gradle.launcher.cli.JavaRuntimeValidationAction.execute(JavaRuntimeValidationAction.java:24)
> at org.gradle.launcher.cli.CommandLineActionFactory$WithLogging.execute(CommandLineActionFactory.java:206)
> at org.gradle.launcher.cli.CommandLineActionFactory$WithLogging.execute(CommandLineActionFactory.java:169)
> at org.gradle.launcher.cli.ExceptionReportingAction.execute(ExceptionReportingAction.java:33)
> at org.gradle.launcher.cli.ExceptionReportingAction.execute(ExceptionReportingAction.java:22)
> at org.gradle.launcher.Main.doAction(Main.java:33)
> at org.gradle.launcher.bootstrap.EntryPoint.run(EntryPoint.java:45)
> at org.gradle.launcher.bootstrap.ProcessBootstrap.runNoExit(ProcessBootstrap.java:54)
> at org.gradle.launcher.bootstrap.ProcessBootstrap.run(ProcessBootstrap.java:35)
> at org.gradle.launcher.GradleMain.main(GradleMain.java:23)
> at org.gradle.wrapper.BootstrapMainStarter.start(BootstrapMainStarter.java:30)
> at org.gradle.wrapper.WrapperExecutor.execute(WrapperExecutor.java:127)
> at org.gradle.wrapper.GradleWrapperMain.main(GradleWrapperMain.java:56)
>Caused by: org.gradle.api.internal.tasks.compile.CompilationFailedException: Compilation failed; see the compiler error output for details.
> at org.gradle.api.internal.tasks.compile.jdk6.Jdk6JavaCompiler.execute(Jdk6JavaCompiler.java:47)
> at org.gradle.api.internal.tasks.compile.jdk6.Jdk6JavaCompiler.execute(Jdk6JavaCompiler.java:38)
> at org.gradle.api.internal.tasks.compile.NormalizingJavaCompiler.delegateAndHandleErrors(NormalizingJavaCompiler.java:96)
> at org.gradle.api.internal.tasks.compile.NormalizingJavaCompiler.execute(NormalizingJavaCompiler.java:49)
> at org.gradle.api.internal.tasks.compile.NormalizingJavaCompiler.execute(NormalizingJavaCompiler.java:35)
> at org.gradle.api.internal.tasks.compile.DelegatingJavaCompiler.execute(DelegatingJavaCompiler.java:29)
> at org.gradle.api.internal.tasks.compile.DelegatingJavaCompiler.execute(DelegatingJavaCompiler.java:20)
> at org.gradle.api.internal.tasks.compile.CleaningJavaCompilerSupport.execute(CleaningJavaCompilerSupport.java:33)
> at org.gradle.api.internal.tasks.compile.CleaningJavaCompilerSupport.execute(CleaningJavaCompilerSupport.java:24)
> at org.gradle.api.tasks.compile.JavaCompile.performCompilation(JavaCompile.java:87)
> at org.gradle.api.tasks.compile.JavaCompile.compile(JavaCompile.java:65)
> at org.gradle.api.tasks.compile.JavaCompile.compile(JavaCompile.java:53)
> at org.gradle.internal.reflect.JavaMethod.invoke(JavaMethod.java:63)
> at org.gradle.api.internal.project.taskfactory.AnnotationProcessingTaskFactory$IncrementalTaskAction.doExecute(AnnotationProcessingTaskFactory.java:235)
> at org.gradle.api.internal.project.taskfactory.AnnotationProcessingTaskFactory$StandardTaskAction.execute(AnnotationProcessingTaskFactory.java:211)
> at org.gradle.api.internal.project.taskfactory.AnnotationProcessingTaskFactory$IncrementalTaskAction.execute(AnnotationProcessingTaskFactory.java:222)
> at org.gradle.api.internal.project.taskfactory.AnnotationProcessingTaskFactory$StandardTaskAction.execute(AnnotationProcessingTaskFactory.java:200)
> at org.gradle.api.internal.tasks.execution.ExecuteActionsTaskExecuter.executeAction(ExecuteActionsTaskExecuter.java:80)
> at org.gradle.api.internal.tasks.execution.ExecuteActionsTaskExecuter.executeActions(ExecuteActionsTaskExecuter.java:61)
> ... 47 more