Variable list and global events give recompilation errors though they are empty

3 posts / 0 new
Last post
Offline
Last seen: 1 year 1 month ago
Joined: 08/10/2014 - 00:09
Gems: 0
Variable list and global events give recompilation errors though they are empty

This started happening after I made a chocolate portal animation to replace the old one which missed a tile. Of course, it isn't mentioned, so that couldn't be. This is the log:

Spoiler: Highlight to view

>Executing gradle command: runClient
>Microsoft Windows [Versi¢n 6.3.9600]
>(c) 2013 Microsoft Corporation. Todos los derechos reservados.
>C:\Pylo\MCreator155>cd forge
>C:\Pylo\MCreator155\forge>SET "JAVA_HOME=C:\Pylo\MCreator155\jdk\"
>C:\Pylo\MCreator155\forge>SET JAVA_EXE=%JAVA_HOME%\bin\java.exe
>C:\Pylo\MCreator155\forge>SET PATH=%JAVA_HOME%\bin\;%PATH%
>C:\Pylo\MCreator155\forge>gradlew runClient
>****************************
> Powered By MCP:             
> http://mcp.ocean-labs.de/   
> Searge, ProfMobius, Fesh0r,
> R4wk, ZeuX, IngisKahn, bspkrs
> MCP Data version : unknown
>****************************
>:compileApiJava UP-TO-DATE
>:processApiResources UP-TO-DATE
>:apiClasses UP-TO-DATE
>:sourceMainJava UP-TO-DATE
>C:\Pylo\MCreator155\forge\build\sources\java\mod\mcreator\mcreator_GlobalEventsChocolateMod.java:133: error: class mcreator_GlobalEventschocolatemod is public, should be declared in a file named mcreator_GlobalEventschocolatemod.java
>public class mcreator_GlobalEventschocolatemod{
>       ^
>C:\Pylo\MCreator155\forge\build\sources\java\mod\mcreator\mcreator_VarListChocolateMod.java:3: error: class mcreator_VarListchocolatemod is public, should be declared in a file named mcreator_VarListchocolatemod.java
>public class mcreator_VarListchocolatemod{
>       ^
>Note: C:\Pylo\MCreator155\forge\build\sources\java\mod\mcreator\mcreator_chocodimension.java uses or overrides a deprecated API.
>2 errors
>:compileJava FAILED
>FAILURE: Build failed with an exception.
>* What went wrong:
>Execution failed for task ':compileJava'.
>> Compilation failed; see the compiler error output for details.
>* Try:
>Run with --stacktrace option to get the stack trace. Run with --info or --debug option to get more log output.
>BUILD FAILED
>Total time: 9.339 secs
>C:\Pylo\MCreator155\forge>
>Task completed with return code 0 in 9788 milliseconds



Offline
Last seen: 1 year 8 months ago
Joined: 08/19/2015 - 15:53
Gems: 0
I have the same problem... I

I have the same problem... I need to use variables, but this error pops-out. I don`t know what to do

Offline
Last seen: 1 year 4 months ago
Joined: 10/09/2015 - 01:30
Gems: 0
same problem. i never use

same problem. i never use vairables or global events but both are giving me errors