i Cant start test minecraft client environment

4 posts / 0 new
Last post
Moking1336's picture
Offline
Last seen: 1 month 2 weeks ago
Joined: 11/22/2014 - 17:03
Gems: 7
i Cant start test minecraft client environment

I CANT TEST MY GAME HERES WHAT HAPPENS btw i removed my name with Name

 

>=========================================================================================================================

>Executing gradle command: runClient
>Microsoft Windows [Version 6.2.9200]
>(c) 2012 Microsoft Corporation. All rights reserved.
>C:\Users\Name\Desktop\MCreator 1.5.5 [1.7.10]>cd forge
>C:\Users\Name\Desktop\MCreator 1.5.5 [1.7.10]\forge>SET "JAVA_HOME=C:\Users\Name\Desktop\MCreator 1.5.5 [1.7.10]\jdk\"
>C:\Users\Name\Desktop\MCreator 1.5.5 [1.7.10]\forge>SET JAVA_EXE=%JAVA_HOME%\bin\java.exe
>C:\Users\Name\Desktop\MCreator 1.5.5 [1.7.10]\forge>SET PATH=%JAVA_HOME%\bin\;%PATH%
>C:\Users\Name\Desktop\MCreator 1.5.5 [1.7.10]\forge>gradlew runClient
>****************************
> Powered By MCP:             
> Searge, ProfMobius, Fesh0r, 
> R4wk, ZeuX, IngisKahn, bspkrs
> MCP Data version : unknown
>****************************
>:downloadClient
>FAILURE: Build failed with an exception.
>* What went wrong:
>java.io.FileNotFoundException: C:\Users\Name\Desktop\MCreator 1.5.5 [1.7.10]\forge\.gradle\2.0\taskArtifacts\cache.properties (The system cannot find the file specified)
>> C:\Users\Name\Desktop\MCreator 1.5.5 [1.7.10]\forge\.gradle\2.0\taskArtifacts\cache.properties (The system cannot find the file specified)
>* Try:
>Run with --stacktrace option to get the stack trace. Run with --info or --debug option to get more log output.
>BUILD FAILED
>Total time: 16.854 secs
>C:\Users\Name\Desktop\MCreator 1.5.5 [1.7.10]\forge>
>Task completed with return code 0 in 17782 milliseconds
>Task return code check OK!
 
 
 
Please help---------------------------------


Offline
Last seen: 8 months 4 weeks ago
Joined: 04/22/2015 - 03:26
Gems: 0
I have this problem too

I have this problem too

AquilaNova's picture
Offline
Last seen: 2 years 1 month ago
Joined: 04/22/2015 - 14:39
Gems: 0
goto > C:\Users\\Desktop

goto > C:\Users\\Desktop\MCreator 1.5.5 [1.7.10]\forge\.gradle\2.0\taskArtifacts\

and add the file

cache.properties

Leave it empty and try recompile.

Offline
Last seen: 1 year 2 months ago
Joined: 04/02/2016 - 15:29
Gems: 0
Im on a mac and if i open

Im on a mac and if i open gradle theres only a wrapper and no 2.0 neither any taskArtifacts :/