1.7.10 155 problem its not working at all

2 posts / 0 new
Last post
Offline
Last seen: 3 months 1 week ago
Joined: 05/16/2014 - 08:43
Gems: 0
1.7.10 155 problem its not working at all

I just downloaded 1.7.10 155 and it will not let me make anything I tryed outting the mod I created in the paste in it but it didnt work so I trade recreating it from scatch for the 3 time but when I create a new tab or something is says (>C:\Pylo\MCreator155\forge>gradlew build
>FAILURE: Build failed with an exception.
>* Where:
>Build file 'C:\Pylo\MCreator155\forge\build.gradle' line: 18
>* What went wrong:
>A problem occurred evaluating root project 'forge'.
>> java.io.EOFException: End of input at line 18583 column 20
>* Try:
>BUILD FAILED
>Run with --stacktrace option to get the stack trace. Run with --info or --debug option to get more log output.
>Total time: 11.969 secs

)

I cant get that to stop showing up. anyone have a clue plz replie to this.



Offline
Last seen: 3 months 1 week ago
Joined: 05/16/2014 - 08:43
Gems: 0
ok its figured out I had to

ok its figured out I had to redo my computer there was a solf war problem