Still Getting reobf failed bug HELP HELP

9 posts / 0 new
Last post
philipS's picture
Offline
Last seen: 1 month 3 days ago
Joined: 02/22/2015 - 11:28
Gems: 6
Still Getting reobf failed bug HELP HELP

Plz help. I just cant make anything. It gives me a reobf failed bug. I updated MCreator and I keep getting the error. I have to update Cosmos Craft (the mod of the week) and i cant!! HELP!



mtn dew 314's picture
Offline
Last seen: 8 months 1 week ago
Joined: 12/20/2014 - 05:43
Gems: -2
can you post the error?

can you post the error?

I love redstone
I live redstone
I bleed redstone
I AM A REDSTONER!!

philipS's picture
Offline
Last seen: 1 month 3 days ago
Joined: 02/22/2015 - 11:28
Gems: 6
>Executing gradle command:

>Executing gradle command: build
>Microsoft Windows [Version 6.3.9600]
>(c) 2013 Microsoft Corporation. Todos os direitos reservados.
>C:\Pylo\MCreator155>cd forge
>C:\Pylo\MCreator155\forge>SET "JAVA_HOME=C:\Pylo\MCreator155\jdk\"
>C:\Pylo\MCreator155\forge>SET JAVA_EXE=%JAVA_HOME%\bin\java.exe
>C:\Pylo\MCreator155\forge>SET PATH=%JAVA_HOME%\bin\;%PATH%
>C:\Pylo\MCreator155\forge>gradlew build
>Download http://files.minecraftforge.net/maven/net/minecraftforge/gradle/ForgeGra...
>****************************
> Powered By MCP:
> http://mcp.ocean-labs.de/
> Searge, ProfMobius, Fesh0r,
> R4wk, ZeuX, IngisKahn, bspkrs
> MCP Data version : unknown
>****************************
>:compileApiJava UP-TO-DATE
>:processApiResources UP-TO-DATE
>:apiClasses UP-TO-DATE
>:sourceMainJava UP-TO-DATE
>:compileJava
>:processResources
>:classes
>:jar
>:compileTestJava UP-TO-DATE
>:processTestResources UP-TO-DATE
>:testClasses UP-TO-DATE
>:test UP-TO-DATE
>:extractMcpData UP-TO-DATE
>:getVersionJson
>:extractUserDev UP-TO-DATE
>:genSrgs SKIPPED
>:reobf FAILED
>FAILURE: Build failed with an exception.
>* What went wrong:
>Execution failed for task ':reobf'.
>> MALFORMED
>* Try:
>Run with --stacktrace option to get the stack trace. Run with --info or --debug option to get more log output.
>BUILD FAILED
>Total time: 2 mins 45.692 secs
>C:\Pylo\MCreator155\forge>
>Task completed with return code 0 in 167690 milliseconds
>Task return code check OK!

(mcreator 1.5.5)

philipS's picture
Offline
Last seen: 1 month 3 days ago
Joined: 02/22/2015 - 11:28
Gems: 6
Please I really need help idk

Please I really need help idk what to do I have tryed everything I need to update Cosmos Craft

philipS's picture
Offline
Last seen: 1 month 3 days ago
Joined: 02/22/2015 - 11:28
Gems: 6
HELP

HELP

xXMCXx's picture
Offline
Last seen: 5 days 6 hours ago
Joined: 12/27/2013 - 21:01
Gems: 382
RE:HELP

@philipS Does this error make your mod un-usable? Does it cause crashes or anything? The task returned "ok" so unless your getting any of that then it shouldn't be an issue.

Moderator

philipS's picture
Offline
Last seen: 1 month 3 days ago
Joined: 02/22/2015 - 11:28
Gems: 6
RE:RE:HELP

@xXMCXx When I put the mod into the mod folder and start the game, I don't have any items of the mod in-game, and the mod isn't listed on "mods" menu.

Wes
Wes's picture
Offline
Last seen: 7 months 1 day ago
Joined: 04/26/2014 - 16:35
Gems: 3
hmmmm

Well are you using a custom recipes ??

Or any caind of event or whats the last think that have you did in mod

The best way in finding errors is to check back mod from latest to oldest element

 

Eye for secrets

philipS's picture
Offline
Last seen: 1 month 3 days ago
Joined: 02/22/2015 - 11:28
Gems: 6
RE:hmmmm

@Wes I'll try thank you