will not export

10 posts / 0 new
Last post
Offline
Last seen: 1 year 6 months ago
Joined: 03/17/2015 - 01:03
Gems: 0
will not export

so i am making my first mod, everything seems perfect, but i cannot export it! i press export, do everything, and the program closes, and there is no mod file on my desktop where i told it to go! heeeeelp! :(



BlockyCrafter's picture
Offline
Last seen: 4 days 1 hour ago
Joined: 12/30/2014 - 15:33
Gems: 83
Same For Me!Using 1.5.5?

Same For Me!Using 1.5.5?

Offline
Last seen: 1 year 6 months ago
Joined: 03/17/2015 - 01:03
Gems: 0
RE:Same For Me!Using 1.5.5?

@BlockyCrafter yep

BlockyCrafter's picture
Offline
Last seen: 4 days 1 hour ago
Joined: 12/30/2014 - 15:33
Gems: 83
Mc Told Me To Try To Export

Mc Told Me To Try To Export As .zip

BlockyCrafter's picture
Offline
Last seen: 4 days 1 hour ago
Joined: 12/30/2014 - 15:33
Gems: 83
RE:Mc Told Me To Try To Export

@BlockyCrafter Oh Okay That Doesn't Work....

Offline
Last seen: 6 months 6 hours ago
Joined: 04/06/2015 - 06:40
Gems: 0
I am having the exact same

I am having the exact same problem.

Offline
Last seen: 1 year 1 month ago
Joined: 04/11/2015 - 20:53
Gems: 0
Same problem here. I go to

Same problem here. I go to export, I put in the file name, name the mod, put in the description, save as a zip and the program just closes. No file.

19062scott Ender Eye's picture
Offline
Last seen: 1 year 1 month ago
Joined: 04/19/2015 - 17:50
Gems: 0
Go into where your MCreator

Go into where your MCreator is saved on disk *ie. C:\Pylo\MCreator* go into the forge file then open the .gradle file and open the txt file gradle and post the either the hole thing or the last 10-20 ish lines

Also when exporting make a name for the file and chose the location then for the Mod Details:----------- Mod Name DO NOT PUT ANY SPACES in it I did it a few times and got errors and it closing on me also. version and author file anyway Mod Image may also be a cause if to big not sure Still new to MCreator only started using it on April 21ish 2015

Offline
Last seen: 1 year 7 months ago
Joined: 06/06/2015 - 02:44
Gems: 0
19062scott Ender Eye it

19062scott Ender Eye 
it righted to me that :

 


FAILURE: Build failed with an exception.

* Where:
Build file 'C:\Pylo\MCreator156\forge\build.gradle' line: 18

* What went wrong:
A problem occurred evaluating root project 'forge'.
> java.io.EOFException: End of input at line 19339 column 11

* Try:
Run with --stacktrace option to get the stack trace. Run with --info or --debug option to get more log output.

BUILD FAILED

Total time: 33.461 secs

can you help me ?

 

Offline
Last seen: 1 year 4 months ago
Joined: 06/27/2015 - 17:45
Gems: 0
I've exactly the same problem

I've exactly the same problem

>FAILURE: Build failed with an exception.

>* Where:
>Build file 'C:\Pylo\MCreator156\forge\build.gradle' line: 18
>* What went wrong:
>A problem occurred evaluating root project 'forge'.
>> java.lang.IllegalStateException: Expected BEGIN_OBJECT but was STRING at line 1 column 1
>* Try:
>Run with --stacktrace option to get the stack trace. Run with --info or --debug option to get more log output.