help global events and variables!

14 posts / 0 new
Last post
Offline
Last seen: 1 year 6 months ago
Joined: 03/12/2015 - 11:37
Gems: 0
help global events and variables!

HELP! i was finishing my mod than this happend in the console!

 

>C:\MCreator 1.5.5 [1.7.10]\forge\build\sources\java\mod\mcreator\mcreator_GlobalEventsTinkerMod.java:133: error: class mcreator_GlobalEventsTinkermod is public, should be declared in a file named mcreator_GlobalEventsTinkermod.java
>public class mcreator_GlobalEventsTinkermod{
>       ^
>C:\MCreator 1.5.5 [1.7.10]\forge\build\sources\java\mod\mcreator\mcreator_VarListTinkerMod.java:3: error: class mcreator_VarListTinkermod is public, should be declared in a file named mcreator_VarListTinkermod.java
>public class mcreator_VarListTinkermod{
>       ^
>2 errors
>:compileJava FAILED
>FAILURE: Build failed with an exception.
>* What went wrong:
>Execution failed for task ':compileJava'.
>> Compilation failed; see the compiler error output for details.
>* Try:
>BUILD FAILED
>Run with --stacktrace option to get the stack trace. Run with --info or --debug option to get more log output.
 
than the error item thing came out and said!
 the problematic mods are 
 global events and varialbe list!
plz help!


Offline
Last seen: 1 year 6 months ago
Joined: 03/12/2015 - 11:37
Gems: 0
Plz Comment!

Plz Comment!

Offline
Last seen: 1 year 6 months ago
Joined: 03/12/2015 - 11:37
Gems: 0
why nobody commenting??

why nobody commenting??

Offline
Last seen: 1 year 1 month ago
Joined: 07/11/2014 - 02:51
Gems: 0
Same problem Please Help

Same problem
Please Help

mtn dew 314's picture
Offline
Last seen: 9 months 6 days ago
Joined: 12/20/2014 - 05:43
Gems: -2
so from what i can understand

so from what i can understand you have two problems

first:
[1.7.10]\forge\build\sources\java\mod\mcreator\mcreator_GlobalEventsTinkerMod.java:133: error: class mcreator_GlobalEventsTinkermod is public, should be declared in a file named mcreator_GlobalEventsTinkermod.java
>public class mcreator_GlobalEventsTinkermod{
> ^
second:
>C:\MCreator 1.5.5 [1.7.10]\forge\build\sources\java\mod\mcreator\mcreator_VarListTinkerMod.java:3: error: class mcreator_VarListTinkermod is public, should be declared in a file named mcreator_VarListTinkermod.java
>public class mcreator_VarListTinkermod{

in the first one it says "should be declared in a file named mcreator_GlobalEventsTinkermod.java
>public class mcreator_GlobalEventsTinkermod{" it tells you right there what it should be.

in the second it says "should be declared in a file named mcreator_VarListTinkermod.java
>public class mcreator_VarListTinkermod" it tells you what it should be again.

i hope this helps

I love redstone
I live redstone
I bleed redstone
I AM A REDSTONER!!

Offline
Last seen: 1 year 6 months ago
Joined: 03/12/2015 - 11:37
Gems: 0
RE:so from what i can understand

@mtn dew 314 err....can you explain that in a more......simple matter?

Offline
Last seen: 4 days 15 hours ago
Joined: 03/12/2015 - 11:51
Gems: 0
RE:so from what i can understand

@mtn dew 314

you didn't really explain it, all you did was repeat what was said he can read
the problem is understanding what is written Iv have the same error recently Iv done nothing to the global event setting so I have no idea what its talking about

mtn dew 314's picture
Offline
Last seen: 9 months 6 days ago
Joined: 12/20/2014 - 05:43
Gems: -2
"should be declared in a file

"should be declared in a file named"

it says it right there in plain English

I love redstone
I live redstone
I bleed redstone
I AM A REDSTONER!!

Offline
Last seen: 1 year 6 months ago
Joined: 03/12/2015 - 11:37
Gems: 0
RE:"should be declared in a file

@mtn dew 314 err....can you explain how to do that in step by step
cause i dont get it

Offline
Last seen: 4 days 15 hours ago
Joined: 03/12/2015 - 11:51
Gems: 0
RE:RE:"should be declared in a file

@mtn dew 314

yea I don't understand either what should be declared in a file name and where what exactly are we supposed to do to resolve this problem its English but it doesn't really explaining much we need more detail we can't read minds

Offline
Last seen: 4 days 15 hours ago
Joined: 03/12/2015 - 11:51
Gems: 0
I posted this same issue and

I posted this same issue and am not getting any response its not a problem that can be fixed by deleting something I added cause thats not the problem so I don't know what it could be I haven't done anything to anything else and I'm only just recently having this problem so I don't know why its happening

Pages