AAAH!!

1 post / 0 new
Offline
Last seen: 2 years 7 months ago
Joined: 03/11/2015 - 22:58
Gems: 0
AAAH!!

When I try to export my mod, it just crashes the game. here is the changelog.

 

****************************
 Powered By MCP:             
 Searge, ProfMobius, Fesh0r, 
 R4wk, ZeuX, IngisKahn, bspkrs
 MCP Data version : unknown
****************************
:cleanCache
:clean
:extractMcpData
 
FAILURE: Build failed with an exception.
 
* What went wrong:
java.io.FileNotFoundException: C:\Program Files (x86)\Pylo\forge\.gradle\2.0\taskArtifacts\cache.properties (The system cannot find the file specified)
> C:\Program Files (x86)\Pylo\forge\.gradle\2.0\taskArtifacts\cache.properties (The system cannot find the file specified)
 
* Try:
Run with --stacktrace option to get the stack trace. Run with --info or --debug option to get more log output.
 
BUILD FAILED
 
Total time: 50.538 secs
 
I am on a PC, running windows 8.1, using MCreator version 1.5.5[1.7.10].        PLEASE HELP!!!
 
 
I tried it again, and this is what I got.
 
>BOOTING UP GRADLE...
>Data loaded, MCreator gradle console ready [ver 1.007]! [boot took 13 milliseconds]
>RIGHT click once to copy log to the clipboard or twice to clear the log.
>=========================================================================================================================
>Executing gradle command: build
>Microsoft Windows [Version 6.3.9600]
>(c) 2013 Microsoft Corporation. All rights reserved.
>C:\Program Files (x86)\Pylo>cd forge
>C:\Program Files (x86)\Pylo\forge>SET "JAVA_HOME=C:\Program Files (x86)\Pylo\jdk\"
>C:\Program Files (x86)\Pylo\forge>SET JAVA_EXE=%JAVA_HOME%\bin\java.exe
>C:\Program Files (x86)\Pylo\forge>SET PATH=%JAVA_HOME%\bin\;%PATH%
>C:\Program Files (x86)\Pylo\forge>gradlew build
>****************************
> Powered By MCP:             
> Searge, ProfMobius, Fesh0r, 
> R4wk, ZeuX, IngisKahn, bspkrs
> MCP Data version : unknown
>****************************
>:downloadClient
>FAILURE: Build failed with an exception.
>* What went wrong:
>java.io.FileNotFoundException: C:\Program Files (x86)\Pylo\forge\.gradle\2.0\taskArtifacts\cache.properties (The system cannot find the file specified)
>> C:\Program Files (x86)\Pylo\forge\.gradle\2.0\taskArtifacts\cache.properties (The system cannot find the file specified)
>BUILD FAILED
>* Try:
>Run with --stacktrace option to get the stack trace. Run with --info or --debug option to get more log output.
>Total time: 18.073 secs
>C:\Program Files (x86)\Pylo\forge>
>Task completed with return code 0 in 19574 milliseconds
>Task return code check OK!
>=========================================================================================================================
>Executing gradle command: build
>Microsoft Windows [Version 6.3.9600]
>(c) 2013 Microsoft Corporation. All rights reserved.
>C:\Program Files (x86)\Pylo>cd forge
>C:\Program Files (x86)\Pylo\forge>SET "JAVA_HOME=C:\Program Files (x86)\Pylo\jdk\"
>C:\Program Files (x86)\Pylo\forge>SET JAVA_EXE=%JAVA_HOME%\bin\java.exe
>C:\Program Files (x86)\Pylo\forge>SET PATH=%JAVA_HOME%\bin\;%PATH%
>C:\Program Files (x86)\Pylo\forge>gradlew build
>****************************
> Powered By MCP:             
> Searge, ProfMobius, Fesh0r, 
> R4wk, ZeuX, IngisKahn, bspkrs
> MCP Data version : unknown
>****************************
>:downloadClient
>FAILURE: Build failed with an exception.
>* What went wrong:
>BUILD FAILED
>java.io.FileNotFoundException: C:\Program Files (x86)\Pylo\forge\.gradle\2.0\taskArtifacts\cache.properties (The system cannot find the file specified)
>> C:\Program Files (x86)\Pylo\forge\.gradle\2.0\taskArtifacts\cache.properties (The system cannot find the file specified)
>* Try:
>Run with --stacktrace option to get the stack trace. Run with --info or --debug option to get more log output.
>Total time: 11.423 secs
>C:\Program Files (x86)\Pylo\forge>
>Task completed with return code 0 in 12242 milliseconds
>Task return code check OK!
 
Bobbin44
Edited by: Bobbin44 on 03/13/2015 - 00:53