Error in MCreator

3 posts / 0 new
Last post
Offline
Last seen: 1 year 8 months ago
Joined: 03/09/2015 - 11:25
Gems: 0
Error in MCreator

This error i see when click "Start Client"

 

>Executing gradle command: runClient
>Microsoft Windows [Version 6.3.9600]
>(c) Љ®аЇ®а жЁп Њ ©Єа®б®дв (Microsoft Corporation), 2013. ‚ᥠЇа ў  § йЁйҐ­л.
>C:\Pylo\MCreator154>cd forge
>C:\Pylo\MCreator154\forge>SET "JAVA_HOME=C:\Pylo\MCreator154\jdk\"
>C:\Pylo\MCreator154\forge>SET JAVA_EXE=%JAVA_HOME%\bin\java.exe
>C:\Pylo\MCreator154\forge>SET PATH=%JAVA_HOME%\bin\;%PATH%
>C:\Pylo\MCreator154\forge>gradlew runClient
>****************************
> Powered By MCP:             
> Searge, ProfMobius, Fesh0r, 
> R4wk, ZeuX, IngisKahn, bspkrs
> MCP Data version : unknown
>****************************
>:compileApiJava UP-TO-DATE
>:processApiResources UP-TO-DATE
>:apiClasses UP-TO-DATE
>:sourceMainJava
>:compileJava
>:processResources
>:classes
>:jar
>:getVersionJson
>:extractUserDev UP-TO-DATE
>:extractNatives UP-TO-DATE
>:copyNativesLegacy UP-TO-DATE
>:getAssetsIndex
>:getAssets
>:makeStart
>:runClient
>[22:31:24] [main/INFO] [GradleStart]: Extra: []
>Exception in thread "main" java.lang.RuntimeException: java.io.FileNotFoundException: C:\Users\Василий\.gradle\caches\minecraft\assets\indexes\1.7.10.json (The system cannot find the path specified)
> at com.google.common.base.Throwables.propagate(Throwables.java:160)
> at GradleStart.setupAssets(Unknown Source)
> at GradleStart.preLaunch(Unknown Source)
> at net.minecraftforge.gradle.GradleStartCommon.launch(Unknown Source)
> at GradleStart.main(Unknown Source)
>Caused by: java.io.FileNotFoundException: C:\Users\Василий\.gradle\caches\minecraft\assets\indexes\1.7.10.json (The system cannot find the path specified)
> at java.io.FileInputStream.open(Native Method)
> at java.io.FileInputStream.<init>(FileInputStream.java:146)
> at java.io.FileReader.<init>(FileReader.java:72)
>:runClient FAILED
> at GradleStart.loadAssetsInd> ... 4 more
ex(Unknown Source)
>FAILURE: Build failed with an exception.
>* What went wrong:
>Execution failed for task ':runClient'.
>BUILD FAILED
>> Process 'command 'C:\Pylo\MCreator154\jdk\bin\java.exe'' finished with non-zero exit value 1
>Total time: 24.051 secs
>* Try:
>Run with --stacktrace option to get the stack trace. Run with --info or --debug option to get more log output.
>C:\Pylo\MCreator154\forge>
>Task completed with return code 0 in 24799 milliseconds
>Task return code check OK!
 
How to fix it? (Sorry for my English)
Edited by: Vaiter on 03/10/2015 - 20:41


Offline
Last seen: 1 week 5 days ago
Joined: 02/24/2015 - 19:32
Gems: 0
Wow. I've never seen it say

Wow. I've never seen it say "BUILD FAILED" And "Task return code check OK" I would export workspace to .mcr and factory reset MCreator then import the .mcr file.

Hope this helps! :D

Offline
Last seen: 2 years 1 week ago
Joined: 03/11/2015 - 22:58
Gems: 0
RE:Wow. I've never seen it say

@Tykinator I have had that problem before too i still can't get it to compile.