Please help minecraft test issues

2 posts / 0 new
Last post
Offline
Last seen: 3 months 4 weeks ago
Joined: 01/05/2015 - 07:38
Gems: 0
Please help minecraft test issues

hello i recently am having problems with my mod when i want to use it in the minecraft test version it gives me a error like this:

C:\Pylo\MCreator155\forge\build\sources\java\mod\mcreator\mcreator_GlobalEventsRandom O' Craft.java:133: error: '{' expected
public class mcreator_GlobalEventsRandom O' Craft{
                                        ^
C:\Pylo\MCreator155\forge\build\sources\java\mod\mcreator\mcreator_GlobalEventsRandom O' Craft.java:133: error: unclosed character literal
public class mcreator_GlobalEventsRandom O' Craft{
                                          ^
C:\Pylo\MCreator155\forge\build\sources\java\mod\mcreator\mcreator_VarListRandom O' Craft.java:3: error: '{' expected
public class mcreator_VarListRandom O' Craft{
                                   ^
C:\Pylo\MCreator155\forge\build\sources\java\mod\mcreator\mcreator_VarListRandom O' Craft.java:3: error: unclosed character literal
public class mcreator_VarListRandom O' Craft{
                                     ^
4 errors
 
FAILURE: Build failed with an exception.
 
* What went wrong:
Execution failed for task ':compileJava'.
> Compilation failed; see the compiler error output for details.
 
* Try:
Run with --stacktrace option to get the stack trace. Run with --info or --debug option to get more log output.
 
here is the mod if somebody will help me!


Offline
Last seen: 2 months 2 weeks ago
Joined: 02/24/2015 - 19:32
Gems: 0
It looks like your Variables

It looks like your Variables and Global Events are messing it up. This is pretty common as its hard to get them just right.