THIS STUPID ERROR

9 posts / 0 new
Last post
igor2's picture
Offline
Last seen: 1 month 2 weeks ago
Joined: 12/27/2013 - 15:28
Gems: 0
THIS STUPID ERROR

Hello,my name is igor2.Last error has eliminated,but new error has detected!

 

Here are logs:

 

 
>C:\Pylo\MCreator155\forge\build\sources\java\ClientProxyTestEnvironmentMod.java:27: error: reached end of file while parsing
>import net.minecraft.entity.monst
>                                 ^
>C:\Pylo\MCreator155\forge\build\sources\java\mcreator_GlobalEventsTestEnvironmentMod.java:28: error: reached end of file while parsing
>i
>^
>C:\Pylo\MCreator155\forge\build\sources\java\mcreator_ternoland.java:28: error: reached end of file while parsing
>i
>^
>C:\Pylo\MCreator155\forge\build\sources\java\mcreator_ternoteumSod.java:28: error: reached end of file while parsing
>i
>^
>4 errors
>:compileJava FAILED
>FAILURE: Build failed with an exception.
>* What went wrong:
>Execution failed for task ':compileJava'.
>> Compilation failed; see the compiler error output for details.
>BUILD FAILED
 
 
Please,help me!ANYWAY!
 
-igor2
 
Edited by: igor2 on 03/08/2015 - 11:49


igor2's picture
Offline
Last seen: 1 month 2 weeks ago
Joined: 12/27/2013 - 15:28
Gems: 0
If it's needed,my MCreator

If it's needed,my MCreator
version is 1.5.4

Offline
Last seen: 1 year 9 months ago
Joined: 03/05/2015 - 14:02
Gems: 0
Better reinstall the

Better reinstall the Minecraft Test Environment..... (Or in short, Reinstall MCreator)

Offline
Last seen: 1 year 9 months ago
Joined: 03/05/2015 - 14:02
Gems: 0
Wait! Backup your user folder

Wait! Backup your user folder inside MCreator directory and paste and replace after reinstall.

igor2's picture
Offline
Last seen: 1 month 2 weeks ago
Joined: 12/27/2013 - 15:28
Gems: 0
Updated MCreator version from

Updated MCreator version from 1.5.4 to 1.5.5.This error is not actual now.

Offline
Last seen: 1 year 9 months ago
Joined: 03/05/2015 - 14:02
Gems: 0
OK, Don't mind my answers

OK, Don't mind my answers

Offline
Last seen: 1 year 7 months ago
Joined: 03/07/2015 - 22:51
Gems: 0
Help me please!!!

Help me please!!!

>FAILURE: Build failed with an exception.
>* What went wrong:
>BUILD FAILED
>Execution failed for t>> MALFORMED
ask ':reobf'.
>Total time: 14.121 secs
>* Try:
>Run with --stacktrace option to get the stack trace. Run with --info or --debug option to get more log output.

igor2's picture
Offline
Last seen: 1 month 2 weeks ago
Joined: 12/27/2013 - 15:28
Gems: 0
RE:Help me please!!!

@DeCiBeL NOTHING ANOTHER ERRORS!

Offline
Last seen: 2 years 2 months ago
Joined: 03/07/2015 - 19:44
Gems: 0
wie kann man heruntergeladene

wie kann man heruntergeladene mods installieren