Error with launching of client

5 posts / 0 new
Last post
igor2's picture
Offline
Last seen: 1 month 3 weeks ago
Joined: 12/27/2013 - 15:28
Gems: 0
Error with launching of client

Hello.My name is igor2,and I can't launch client.Always when I try do it,MCreator instantly close Minecraft window and write this error:

 

>C:\Pylo\MCreator154\forge\build\sources\java\mod\mcreator\TestEnvironmentMod.java:109: error: cannot find symbol
>mcreator_ternoteumDirt mcreator_1 = new mcreator_ternoteumDirt();
>^
>  symbol:   class mcreator_ternoteumDirt
>  location: class TestEnvironmentMod
>C:\Pylo\MCreator154\forge\build\sources\java\mod\mcreator\TestEnvironmentMod.java:109: error: cannot find symbol
>mcreator_ternoteumDirt mcreator_1 = new mcreator_ternoteumDirt();
>                                        ^
>  symbol:   class mcreator_ternoteumDirt
>  location: class TestEnvironmentMod
>Note: C:\Pylo\MCreator154\forge\build\sources\java\mcreator_ternoland.java uses or overrides a deprecated API.
>2 errors
>:compileJava FAILED
>FAILURE: Build failed with an exception.
>* What went wrong:
>BUILD FAILED
>Execution failed for task ':>> Compilation>Total time: 7.267 secs
 failed; see the compiler error output for details.
compileJava'.
 
HELP ME!IT'S A VERY IMPORTANT,WITHOUT THIS I CAN'T TEST THE MOD!PLEASE!
 
-igor2


igor2's picture
Offline
Last seen: 1 month 3 weeks ago
Joined: 12/27/2013 - 15:28
Gems: 0
If you can help me anyway

If you can help me anyway,please,anwser!

igor2's picture
Offline
Last seen: 1 month 3 weeks ago
Joined: 12/27/2013 - 15:28
Gems: 0
Coo.

Coo.

Yusanis2014's picture
Offline
Last seen: 1 month 3 weeks ago
Joined: 01/23/2014 - 18:00
Gems: 0
Okay I looked at this and I

Okay I looked at this and I think it has something to do with a custom block you have that caused 1 of 2 errors.

GH127's picture
Offline
Last seen: 3 months 1 day ago
Joined: 01/16/2015 - 19:00
Gems: -1
Delete the "TernoteumDirt"

Delete the "TernoteumDirt" and re do it.This should work