[SOLVED] Build failed

7 posts / 0 new
Last post
Offline
Last seen: 2 years 2 months ago
Joined: 03/03/2015 - 15:45
Gems: 0
[SOLVED] Build failed

I always have an error and dont know what to do:

 

>[Fatal Error] jobs-3.5.300-v20130429-1813.pom:1:44: Content ist nicht zulässig in Prolog.
>[Fatal Error] expressions-3.3.0-v20070606-0010.pom:1:44: Content ist nicht zulässig in Prolog.
>FAILURE: Build failed with an exception.
>* What went wrong:
>A problem occurred configuring root project 'forge'.
>> Could not resolve all dependencies for configuration ':classpath'.
>   > Could not resolve org.eclipse.core:expressions:[3.1.0,4.0.0).
>     Required by:
>         :forge:unspecified > net.minecraftforge.gradle:ForgeGradle:1.2-SNAPSHOT > net.minecraftforge.srg2source:Srg2Source:3.2-SNAPSHOT > org.eclipse.core:resources:3.2.1-R32x_v20060914
>      > Could not parse POM http://repo1.maven.org/maven2/org/eclipse/core/expressions/3.3.0-v200706...
>BUILD FAILED
>         > Content ist nicht zulässig in Prolog.

:(

Edited by: MirkoCrafter on 03/04/2015 - 08:31


Offline
Last seen: 2 years 2 months ago
Joined: 03/03/2015 - 15:45
Gems: 0
Just need to run the Exe as

Just need to run the Exe as Admin -.- that was so simple xD

Offline
Last seen: 2 years 2 months ago
Joined: 03/11/2015 - 15:35
Gems: 0
RE:Just need to run the Exe as

@MirkoCrafter Uhm i Have the same problem, but i ran it as Adminstrator!

Offline
Last seen: 2 years 2 months ago
Joined: 03/11/2015 - 22:58
Gems: 0
RE:RE:Just need to run the Exe as

@01JoWin >BOOTING UP GRADLE...
>Data loaded, MCreator gradle console ready [ver 1.007]! [boot took 10 milliseconds]
>RIGHT click once to copy log to the clipboard or twice to clear the log.
>=========================================================================================================================
>Executing gradle command: eclipse
>Microsoft Windows [Version 6.3.9600]
>(c) 2013 Microsoft Corporation. All rights reserved.
>C:\pylo\MCreator>cd forge
>C:\pylo\MCreator\forge>SET "JAVA_HOME=C:\pylo\MCreator\jdk\"
>C:\pylo\MCreator\forge>SET JAVA_EXE=%JAVA_HOME%\bin\java.exe
>C:\pylo\MCreator\forge>SET PATH=%JAVA_HOME%\bin\;%PATH%
>C:\pylo\MCreator\forge>gradlew eclipse
>****************************
> Powered By MCP:
> http://mcp.ocean-labs.de/
> Searge, ProfMobius, Fesh0r,
> R4wk, ZeuX, IngisKahn, bspkrs
> MCP Data version : unknown
>****************************
>=========================================================================================================================
>Executing gradle command: build
>Microsoft Windows [Version 6.3.9600]
>(c) 2013 Microsoft Corporation. All rights reserved.
>C:\pylo\MCreator>cd forge
>C:\pylo\MCreator\forge>SET "JAVA_HOME=C:\pylo\MCreator\jdk\"
>C:\pylo\MCreator\forge>SET JAVA_EXE=%JAVA_HOME%\bin\java.exe
>C:\pylo\MCreator\forge>SET PATH=%JAVA_HOME%\bin\;%PATH%
>C:\pylo\MCreator\forge>gradlew build
>****************************
> Powered By MCP:
> http://mcp.ocean-labs.de/
> Searge, ProfMobius, Fesh0r,
> R4wk, ZeuX, IngisKahn, bspkrs
> MCP Data version : unknown
>****************************
>:downloadClient SKIPPED
>:downloadServer SKIPPED
>:getVersionJson
>=========================================================================================================================
>Executing gradle command: build
>Microsoft Windows [Version 6.3.9600]
>(c) 2013 Microsoft Corporation. All rights reserved.
>C:\pylo\MCreator>cd forge
>C:\pylo\MCreator\forge>SET "JAVA_HOME=C:\pylo\MCreator\jdk\"
>C:\pylo\MCreator\forge>SET JAVA_EXE=%JAVA_HOME%\bin\java.exe
>C:\pylo\MCreator\forge>SET PATH=%JAVA_HOME%\bin\;%PATH%
>C:\pylo\MCreator\forge>gradlew build
>****************************
> Powered By MCP:
> http://mcp.ocean-labs.de/
> Searge, ProfMobius, Fesh0r,
> R4wk, ZeuX, IngisKahn, bspkrs
> MCP Data version : unknown
>****************************
>:downloadClient SKIPPED
>:downloadServer SKIPPED
>:getVersionJson
>=========================================================================================================================
>Executing gradle command: build
>Microsoft Windows [Version 6.3.9600]
>(c) 2013 Microsoft Corporation. All rights reserved.
>C:\pylo\MCreator>cd forge
>C:\pylo\MCreator\forge>SET "JAVA_HOME=C:\pylo\MCreator\jdk\"
>C:\pylo\MCreator\forge>SET JAVA_EXE=%JAVA_HOME%\bin\java.exe
>C:\pylo\MCreator\forge>SET PATH=%JAVA_HOME%\bin\;%PATH%
>C:\pylo\MCreator\forge>gradlew build
>****************************
> Powered By MCP:
> http://mcp.ocean-labs.de/
> Searge, ProfMobius, Fesh0r,
> R4wk, ZeuX, IngisKahn, bspkrs
> MCP Data version : unknown
>****************************
>:downloadClient SKIPPED
>:downloadServer SKIPPED
>:getVersionJson

I ran it as admin and this is my log from boot. It won't Compile.

Offline
Last seen: 2 years 2 months ago
Joined: 03/11/2015 - 15:35
Gems: 0
RE:RE:RE:Just need to run the Exe as

@Bobbin44 Exactly!

Offline
Last seen: 2 years 2 months ago
Joined: 03/11/2015 - 22:58
Gems: 0
RE:RE:RE:RE:Just need to run the Exe as

@01JoWin I got it to work I just deleted it and ran the installer again.

Offline
Last seen: 2 years 2 weeks ago
Joined: 05/09/2015 - 14:30
Gems: 0
I need some help please.

I need some help please.

A build problem, but different to yours, here's the info:

 

>=========================================================================================================================
>Executing gradle command: build
>Microsoft Windows [Version 6.3.9600]
>(c) 2013 Microsoft Corporation. All rights reserved.
>C:\Users\naisba\Downloads>cd forge
>C:\Users\naisba\Downloads\forge>SET "JAVA_HOME=C:\Users\naisba\Downloads\jdk\"
>C:\Users\naisba\Downloads\forge>SET JAVA_EXE=%JAVA_HOME%\bin\java.exe
>C:\Users\naisba\Downloads\forge>SET PATH=%JAVA_HOME%\bin\;%PATH%
>C:\Users\naisba\Downloads\forge>gradlew build
>****************************
> Powered By MCP:             
> Searge, ProfMobius, Fesh0r, 
> R4wk, ZeuX, IngisKahn, bspkrs
> MCP Data version : unknown
>****************************
>FAILURE: Build failed with an exception.
>* What went wrong:
>A problem occurred configuring root project 'forge'.
>> java.lang.IllegalStateException: Expected BEGIN_OBJECT but was STRING at line 1 column 1
>* Try:
>Run with --stacktrace option to get the stack trace. Run with --info or --debug option to get more log output.
>BUILD FAILED
>Total time: 13.979 secs
>C:\Users\naisba\Downloads\forge>
>Task completed with return code 0 in 15030 milliseconds
>Task return code check OK!