Reobf FAILED Help me! (compile error)

1 post / 0 new
Offline
Last seen: 1 year 11 months ago
Joined: 02/18/2015 - 14:34
Gems: 0
Reobf FAILED Help me! (compile error)
Hi! pleasy help me i cant create a mod because im geting this error  >:reobf FAILED
>Executing gradle command: build
>Microsoft Windows [versÆo 6.1.7601]
>Copyright (c) 2009 Microsoft Corporation. Todos os direitos reservados.
>C:\Pylo\MCreator154>cd forge
>C:\Pylo\MCreator154\forge>SET "JAVA_HOME=C:\Pylo\MCreator154\jdk\"
>C:\Pylo\MCreator154\forge>SET JAVA_EXE=%JAVA_HOME%\bin\java.exe
>C:\Pylo\MCreator154\forge>SET PATH=%JAVA_HOME%\bin\;%PATH%
>C:\Pylo\MCreator154\forge>gradlew build
>****************************
> Powered By MCP:             
> Searge, ProfMobius, Fesh0r, 
> R4wk, ZeuX, IngisKahn, bspkrs
> MCP Data version : unknown
>****************************
>:compileApiJava UP-TO-DATE
>:processApiResources UP-TO-DATE
>:apiClasses UP-TO-DATE
>:sourceMainJava
>:compileJava
>:processResources
>:classes
>:jar
>:compileTestJava UP-TO-DATE
>:processTestResources UP-TO-DATE
>:testClasses UP-TO-DATE
>:test UP-TO-DATE
>:extractMcpData UP-TO-DATE
>:getVersionJson
>:extractUserDev UP-TO-DATE
>:genSrgs SKIPPED
>:reobf FAILED
>FAILURE: Build failed with an exception.
>* What went wrong:
>Execution failed for task ':reobf'.
>BUILD FAILED
>> MALFORMED
>Total time: 45.809 secs
>* Try:
>Run with --stacktrace option to get the stack trace. Run with --info or --debug option to get more log output.
>C:\Pylo\MCreator154\forge>
>Task completed with return code 0 in 47079 milliseconds
>Task return code check OK!
 
 
 a time ago i created mods with no problems but now i get this error every time pleasy help me!
Edited by: devlaranjarox on 02/18/2015 - 15:04