HELP, CLIENT WON'T LOAD!!!!!!!!!!!!!!!!

4 posts / 0 new
Last post
AaronAwesome10's picture
Offline
Last seen: 2 years 9 months ago
Joined: 01/12/2015 - 21:45
Gems: 0
HELP, CLIENT WON'T LOAD!!!!!!!!!!!!!!!!

Hey everyone I need help, my client won't load and this is what comes up every SINGLE TIME!!!!!! (Pls respond): >===================================================================================================================

>Executing gradle command: runClient
>Microsoft Windows [Version 6.3.9600]
>(c) 2013 Microsoft Corporation. All rights reserved.
>C:\Pyro\MCreator>cd forge
>C:\Pyro\MCreator\forge>SET "JAVA_HOME=C:\Pyro\MCreator\jdk\"
>C:\Pyro\MCreator\forge>SET JAVA_EXE=%JAVA_HOME%\bin\java.exe
>C:\Pyro\MCreator\forge>SET PATH=%JAVA_HOME%\bin\;%PATH%
>C:\Pyro\MCreator\forge>gradlew runClient
>****************************
> Powered By MCP:             
> Searge, ProfMobius, Fesh0r, 
> R4wk, ZeuX, IngisKahn, bspkrs
> MCP Data version : unknown
>****************************
>:compileApiJava UP-TO-DATE
>:processApiResources UP-TO-DATE
>:apiClasses UP-TO-DATE
>:sourceMainJava UP-TO-DATE
>C:\Pyro\MCreator\forge\build\sources\java\mod\mcreator\TestEnvironmentMod.java:109: error: cannot find symbol
>mcreator_aaronAwesome10 mcreator_1 = new mcreator_aaronAwesome10();
>^
>  symbol:   class mcreator_aaronAwesome10
>  location: class TestEnvironmentMod
>C:\Pyro\MCreator\forge\build\sources\java\mod\mcreator\TestEnvironmentMod.java:109: error: cannot find symbol
>mcreator_aaronAwesome10 mcreator_1 = new mcreator_aaronAwesome10();
>                                         ^
>  symbol:   class mcreator_aaronAwesome10
>  location: class TestEnvironmentMod
>2 errors
>:compileJava FAILED
>FAILURE: Build failed with an exception.
>* What went wrong:
>Execution failed for task ':compileJava'.
>BUILD FAILED
>> Compilation failed; see the compiler error output for details.
>Total time: 9.192 secs
>* Try:
>Run with --stacktrace option to get the stack trace. Run with --info or --debug option to get more log output.
>C:\Pyro\MCreator\forge>
>Task completed with return code 0 in 9941 milliseconds
 


Wes
Wes's picture
Offline
Last seen: 7 months 3 weeks ago
Joined: 04/26/2014 - 16:35
Gems: 3
Re-Create Armor Without

Re-Create Armor Without Events And Use Only Letters in name

 

Eye for secrets

AaronAwesome10's picture
Offline
Last seen: 2 years 9 months ago
Joined: 01/12/2015 - 21:45
Gems: 0
RE:Re-Create Armor Without

@Wes thanks :)

Wes
Wes's picture
Offline
Last seen: 7 months 3 weeks ago
Joined: 04/26/2014 - 16:35
Gems: 3
RE:RE:Re-Create Armor Without

@AaronAwesome10 If This WIll Not Gona Help than send me your work space

 

Eye for secrets