Can't Export to .zip and .jar file! :(

9 posts / 0 new
Last post
Offline
Last seen: 2 years 1 month ago
Joined: 01/10/2015 - 10:57
Gems: 0
Can't Export to .zip and .jar file! :(

After I create 17 mods, I want to export it to .zip / .jar file

But... 

 

>BOOTING UP GRADLE...
>Data loaded, MCreator gradle console ready [ver 1.007]! [boot took 37 milliseconds]
>RIGHT click once to copy log to the clipboard or twice to clear the log.
>===================================================================================================================
>Executing gradle command: build
>Microsoft Windows [Version 6.1.7601]
>Copyright (c) 2009 Microsoft Corporation.  All rights reserved.
>D:\Pylo\MCreator154>cd forge
>D:\Pylo\MCreator154\forge>SET "JAVA_HOME=D:\Pylo\MCreator154\jdk\"
>D:\Pylo\MCreator154\forge>SET JAVA_EXE=%JAVA_HOME%\bin\java.exe
>D:\Pylo\MCreator154\forge>SET PATH=%JAVA_HOME%\bin\;%PATH%
>D:\Pylo\MCreator154\forge>gradlew build
>****************************
> Powered By MCP:             
> Searge, ProfMobius, Fesh0r, 
> R4wk, ZeuX, IngisKahn, bspkrs
> MCP Data version : unknown
>****************************
>:compileApiJava UP-TO-DATE
>:processApiResources UP-TO-DATE
>:apiClasses UP-TO-DATE
>:sourceMainJava
>D:\Pylo\MCreator154\forge\build\sources\java\mod\mcreator\ModName.java:109: error: cannot find symbol
>mcreator_wOTAOreblock mcreator_1 = new mcreator_wOTAOreblock();
>^
>  symbol:   class mcreator_wOTAOreblock
>  location: class ModName
>D:\Pylo\MCreator154\forge\build\sources\java\mod\mcreator\ModName.java:110: error: cannot find symbol
>mcreator_wOTAGemsBlock mcreator_2 = new mcreator_wOTAGemsBlock();
>^
>  symbol:   class mcreator_wOTAGemsBlock
>  location: class ModName
>D:\Pylo\MCreator154\forge\build\sources\java\mod\mcreator\ModName.java:111: error: cannot find symbol
>mcreator_featherSAO mcreator_3 = new mcreator_featherSAO();
>^
>  symbol:   class mcreator_featherSAO
>  location: class ModName
>D:\Pylo\MCreator154\forge\build\sources\java\mod\mcreator\ModName.java:112: error: cannot find symbol
>mcreator_laserSword mcreator_4 = new mcreator_laserSword();
>^
>  symbol:   class mcreator_laserSword
>  location: class ModName
>D:\Pylo\MCreator154\forge\build\sources\java\mod\mcreator\ModName.java:113: error: cannot find symbol
>mcreator_saoduck mcreator_5 = new mcreator_saoduck();
>^
>  symbol:   class mcreator_saoduck
>  location: class ModName
>D:\Pylo\MCreator154\forge\build\sources\java\mod\mcreator\ModName.java:114: error: cannot find symbol
>mcreator_wOTAFansArmor mcreator_6 = new mcreator_wOTAFansArmor();
>^
>  symbol:   class mcreator_wOTAFansArmor
>  location: class ModName
>D:\Pylo\MCreator154\forge\build\sources\java\mod\mcreator\ModName.java:115: error: cannot find symbol
>mcreator_wOTAGemsBox mcreator_7 = new mcreator_wOTAGemsBox();
>^
>  symbol:   class mcreator_wOTAGemsBox
>  location: class ModName
>D:\Pylo\MCreator154\forge\build\sources\java\mod\mcreator\ModName.java:116: error: cannot find symbol
>mcreator_wOTASkill mcreator_8 = new mcreator_wOTASkill();
>^
>  symbol:   class mcreator_wOTASkill
>  location: class ModName
>D:\Pylo\MCreator154\forge\build\sources\java\mod\mcreator\ModName.java:117: error: cannot find symbol
>mcreator_wOTAGuardian mcreator_9 = new mcreator_wOTAGuardian();
>^
>  symbol:   class mcreator_wOTAGuardian
>  location: class ModName
>D:\Pylo\MCreator154\forge\build\sources\java\mod\mcreator\ModName.java:118: error: cannot find symbol
>mcreator_caramel mcreator_10 = new mcreator_caramel();
>^
>  symbol:   class mcreator_caramel
>  location: class ModName
>D:\Pylo\MCreator154\forge\build\sources\java\mod\mcreator\ModName.java:119: error: cannot find symbol
>mcreator_chocolate mcreator_11 = new mcreator_chocolate();
>^
>  symbol:   class mcreator_chocolate
>  location: class ModName
>D:\Pylo\MCreator154\forge\build\sources\java\mod\mcreator\ModName.java:120: error: cannot find symbol
>mcreator_lightStick mcreator_12 = new mcreator_lightStick();
>^
>  symbol:   class mcreator_lightStick
>  location: class ModName
>D:\Pylo\MCreator154\forge\build\sources\java\mod\mcreator\ModName.java:121: error: cannot find symbol
>mcreator_lights mcreator_13 = new mcreator_lights();
>^
>  symbol:   class mcreator_lights
>  location: class ModName
>D:\Pylo\MCreator154\forge\build\sources\java\mod\mcreator\ModName.java:122: error: cannot find symbol
>mcreator_wOTAGuns mcreator_14 = new mcreator_wOTAGuns();
>^
>  symbol:   class mcreator_wOTAGuns
>  location: class ModName
>D:\Pylo\MCreator154\forge\build\sources\java\mod\mcreator\ModName.java:123: error: cannot find symbol
>mcreator_pLayerIlen mcreator_15 = new mcreator_pLayerIlen();
>^
>  symbol:   class mcreator_pLayerIlen
>  location: class ModName
>D:\Pylo\MCreator154\forge\build\sources\java\mod\mcreator\ModName.java:124: error: cannot find symbol
>mcreator_wotawoodblock mcreator_16 = new mcreator_wotawoodblock();
>^
>  symbol:   class mcreator_wotawoodblock
>  location: class ModName
>D:\Pylo\MCreator154\forge\build\sources\java\mod\mcreator\ModName.java:125: error: cannot find symbol
>mcreator_jasonHR mcreator_17 = new mcreator_jasonHR();
>^
>  symbol:   class mcreator_jasonHR
>  location: class ModName
>D:\Pylo\MCreator154\forge\build\sources\java\mod\mcreator\ModName.java:109: error: cannot find symbol
>mcreator_wOTAOreblock mcreator_1 = new mcreator_wOTAOreblock();
>                                       ^
>  symbol:   class mcreator_wOTAOreblock
>  location: class ModName
>D:\Pylo\MCreator154\forge\build\sources\java\mod\mcreator\ModName.java:110: error: cannot find symbol
>mcreator_wOTAGemsBlock mcreator_2 = new mcreator_wOTAGemsBlock();
>                                        ^
>  symbol:   class mcreator_wOTAGemsBlock
>  location: class ModName
>D:\Pylo\MCreator154\forge\build\sources\java\mod\mcreator\ModName.java:111: error: cannot find symbol
>mcreator_featherSAO mcreator_3 = new mcreator_featherSAO();
>                                     ^
>  symbol:   class mcreator_featherSAO
>  location: class ModName
>D:\Pylo\MCreator154\forge\build\sources\java\mod\mcreator\ModName.java:112: error: cannot find symbol
>mcreator_laserSword mcreator_4 = new mcreator_laserSword();
>                                     ^
>  symbol:   class mcreator_laserSword
>  location: class ModName
>D:\Pylo\MCreator154\forge\build\sources\java\mod\mcreator\ModName.java:113: error: cannot find symbol
>mcreator_saoduck mcreator_5 = new mcreator_saoduck();
>                                  ^
>  symbol:   class mcreator_saoduck
>  location: class ModName
>D:\Pylo\MCreator154\forge\build\sources\java\mod\mcreator\ModName.java:114: error: cannot find symbol
>mcreator_wOTAFansArmor mcreator_6 = new mcreator_wOTAFansArmor();
>                                        ^
>  symbol:   class mcreator_wOTAFansArmor
>  location: class ModName
>D:\Pylo\MCreator154\forge\build\sources\java\mod\mcreator\ModName.java:115: error: cannot find symbol
>mcreator_wOTAGemsBox mcreator_7 = new mcreator_wOTAGemsBox();
>                                      ^
>  symbol:   class mcreator_wOTAGemsBox
>  location: class ModName
>D:\Pylo\MCreator154\forge\build\sources\java\mod\mcreator\ModName.java:116: error: cannot find symbol
>mcreator_wOTASkill mcreator_8 = new mcreator_wOTASkill();
>                                    ^
>  symbol:   class mcreator_wOTASkill
>  location: class ModName
>D:\Pylo\MCreator154\forge\build\sources\java\mod\mcreator\ModName.java:117: error: cannot find symbol
>mcreator_wOTAGuardian mcreator_9 = new mcreator_wOTAGuardian();
>                                       ^
>  symbol:   class mcreator_wOTAGuardian
>  location: class ModName
>D:\Pylo\MCreator154\forge\build\sources\java\mod\mcreator\ModName.java:118: error: cannot find symbol
>mcreator_caramel mcreator_10 = new mcreator_caramel();
>                                   ^
>  symbol:   class mcreator_caramel
>  location: class ModName
>D:\Pylo\MCreator154\forge\build\sources\java\mod\mcreator\ModName.java:119: error: cannot find symbol
>mcreator_chocolate mcreator_11 = new mcreator_chocolate();
>                                     ^
>  symbol:   class mcreator_chocolate
>  location: class ModName
>D:\Pylo\MCreator154\forge\build\sources\java\mod\mcreator\ModName.java:120: error: cannot find symbol
>mcreator_lightStick mcreator_12 = new mcreator_lightStick();
>                                      ^
>  symbol:   class mcreator_lightStick
>  location: class ModName
>D:\Pylo\MCreator154\forge\build\sources\java\mod\mcreator\ModName.java:121: error: cannot find symbol
>mcreator_lights mcreator_13 = new mcreator_lights();
>                                  ^
>  symbol:   class mcreator_lights
>  location: class ModName
>D:\Pylo\MCreator154\forge\build\sources\java\mod\mcreator\ModName.java:122: error: cannot find symbol
>mcreator_wOTAGuns mcreator_14 = new mcreator_wOTAGuns();
>                                    ^
>  symbol:   class mcreator_wOTAGuns
>  location: class ModName
>D:\Pylo\MCreator154\forge\build\sources\java\mod\mcreator\ModName.java:123: error: cannot find symbol
>mcreator_pLayerIlen mcreator_15 = new mcreator_pLayerIlen();
>                                      ^
>  symbol:   class mcreator_pLayerIlen
>  location: class ModName
>D:\Pylo\MCreator154\forge\build\sources\java\mod\mcreator\ModName.java:124: error: cannot find symbol
>mcreator_wotawoodblock mcreator_16 = new mcreator_wotawoodblock();
>                                         ^
>  symbol:   class mcreator_wotawoodblock
>  location: class ModName
>D:\Pylo\MCreator154\forge\build\sources\java\mod\mcreator\ModName.java:125: error: cannot find symbol
>mcreator_jasonHR mcreator_17 = new mcreator_jasonHR();
>                                   ^
>  symbol:   class mcreator_jasonHR
>  location: class ModName
>34 errors
>:compileJava FAILED
>FAILURE: Build failed with an exception.
>* What went wrong:
>Execution failed for task ':compileJava'.
>> Compilation failed; see the compiler error output for details.
>* Try:
>Run with --stacktrace option to get the stack trace. Run with --info or --debug option to get more log output.
>BUILD FAILED
>Total time: 2 mins 39.053 secs
>D:\Pylo\MCreator154\forge>
>Task completed with return code 0 in 159847 milliseconds
 
 
How to fix it?


Offline
Last seen: 2 years 1 month ago
Joined: 01/10/2015 - 10:57
Gems: 0
Respon please ::

Respon please ::

Wes
Wes's picture
Offline
Last seen: 1 month 3 days ago
Joined: 04/26/2014 - 16:35
Gems: 3
Try to Just Export Don't Edit

Try to Just Export Don't Edit any Information If they are not Necessary like Description or Mod Version :)

Offline
Last seen: 2 years 1 month ago
Joined: 01/10/2015 - 10:57
Gems: 0
But, how to fix it?

But, how to fix it?
It's working but the console said it's failed.

When I tried my mod in .zip file, my minecraft is crashing

Offline
Last seen: 1 year 12 months ago
Joined: 01/14/2015 - 16:33
Gems: 0
When i try to export it

When i try to export it crashes

Offline
Last seen: 1 year 2 months ago
Joined: 11/24/2015 - 01:23
Gems: 0
thats whats happening to me

thats whats happening to me too

 

Offline
Last seen: 1 month 4 weeks ago
Joined: 11/26/2015 - 16:27
Gems: 0
It crashes me and i cant do

It crashes me and i cant do the test envoroment

 

Offline
Last seen: 1 month 4 weeks ago
Joined: 11/26/2015 - 16:27
Gems: 0
it says this btw

it says this btw

BOOTING UP GRADLE...
Data loaded, MCreator gradle console ready [ver 1.007]! [boot took 0 milliseconds]
RIGHT click once to copy log to the clipboard or twice to clear the log.
  
Executing gradle command: clean runClient
Microsoft Windows [Version 6.3.9600]
(c) 2013 Microsoft Corporation. All rights reserved.
C:\Users\karri_000\Desktop>cd forge
C:\Users\karri_000\Desktop\forge>SET "JAVA_HOME=C:\Users\karri_000\Desktop\jdk\"
C:\Users\karri_000\Desktop\forge>SET JAVA_EXE=%JAVA_HOME%\bin\java.exe
C:\Users\karri_000\Desktop\forge>SET PATH=%JAVA_HOME%\bin\;%PATH%
C:\Users\karri_000\Desktop\forge>SET "JAVA_OPTS=-Xmx256m -Xms256m"
C:\Users\karri_000\Desktop\forge>gradlew clean runClient
****************************
 Powered By MCP:            
 http://modcoderpack.com/   
 Searge, ProfMobius, Fesh0r,
 R4wk, ZeuX, IngisKahn, bspkrs
 MCP Data version : snapshot_20141130
****************************
:clean
:downloadClient SKIPPED
:downloadServer SKIPPED
:getVersionJson
:extractUserDev UP-TO-DATE
:mergeJars SKIPPED
:applyBinPatches SKIPPED
:downloadMcpTools SKIPPED
:extractMcpData UP-TO-DATE
:genSrgs SKIPPED
:deobfBinJar SKIPPED
:compileApiJava UP-TO-DATE
:processApiResources UP-TO-DATE
:apiClasses UP-TO-DATE
:sourceMainJava
The system is out of resources.
Consult the following stack trace for details.
java.lang.OutOfMemoryError: Java heap space
 at com.sun.tools.javac.util.Position$LineMapImpl.build(Position.java:153)
 at com.sun.tools.javac.util.Position.makeLineMap(Position.java:77)
 at com.sun.tools.javac.parser.Scanner.getLineMap(Scanner.java:1147)
 at com.sun.tools.javac.parser.JavacParser.parseCompilationUnit(JavacParser.java:2310)
 at com.sun.tools.javac.main.JavaCompiler.parse(JavaCompiler.java:595)
 at com.sun.tools.javac.main.JavaCompiler.parse(JavaCompiler.java:632)
 at com.sun.tools.javac.main.JavaCompiler.parseFiles(JavaCompiler.java:909)
 at com.sun.tools.javac.main.JavaCompiler.compile(JavaCompiler.java:824)
 at com.sun.tools.javac.main.Main.compile(Main.java:439)
 at com.sun.tools.javac.api.JavacTaskImpl.call(JavacTaskImpl.java:132)
 at org.gradle.api.internal.tasks.compile.jdk6.Jdk6JavaCompiler.execute(Jdk6JavaCompiler.java:45)
 at org.gradle.api.internal.tasks.compile.jdk6.Jdk6JavaCompiler.execute(Jdk6JavaCompiler.java:38)
 at org.gradle.api.internal.tasks.compile.NormalizingJavaCompiler.delegateAndHandleErrors(NormalizingJavaCompiler.java:96)
 at org.gradle.api.internal.tasks.compile.NormalizingJavaCompiler.execute(NormalizingJavaCompiler.java:49)
 at org.gradle.api.internal.tasks.compile.NormalizingJavaCompiler.execute(NormalizingJavaCompiler.java:35)
 at org.gradle.api.internal.tasks.compile.DelegatingJavaCompiler.execute(DelegatingJavaCompiler.java:29)
 at org.gradle.api.internal.tasks.compile.DelegatingJavaCompiler.execute(DelegatingJavaCompiler.java:20)
 at org.gradle.api.internal.tasks.compile.CleaningJavaCompilerSupport.execute(CleaningJavaCompilerSupport.java:33)
 at org.gradle.api.internal.tasks.compile.CleaningJavaCompilerSupport.execute(CleaningJavaCompilerSupport.java:24)
 at org.gradle.api.tasks.compile.JavaCompile.performCompilation(JavaCompile.java:87)
 at org.gradle.api.tasks.compile.JavaCompile.compile(JavaCompile.java:65)
 at org.gradle.api.tasks.compile.JavaCompile.compile(JavaCompile.java:53)
 at sun.reflect.NativeMethodAccessorImpl.invoke0(Native Method)
 at sun.reflect.NativeMethodAccessorImpl.invoke(NativeMethodAccessorImpl.java:57)
:compileJava FAILED
 at sun.reflect.DelegatingMethodAccessorImpl.invoke(DelegatingMethodAccessorImpl.java:43)
 at java.lang.reflect.Method.invo at org.gradle.internal.reflect.JavaMethod.invoke(JavaMethod.java:63)
ke(Method.java:606)
 at org.gradle.api.internal.project.taskfactory.AnnotationProcessingTaskFactory$IncrementalTaskAction.doExecute(AnnotationProcessingTaskFactory.java:235)
 at org.gradle.api.internal.project.taskfactory.AnnotationProcessingTaskFactory$StandardTaskAction.execute(AnnotationProcessingTaskFactory.java:211)
 at org.gradle.api.internal.project.taskfactory.AnnotationProcessingTaskFactory$IncrementalTaskAction.execute(AnnotationProcessingTaskFactory.java:222)
 at org.gradle.api.internal.project.taskfactory.AnnotationProcessingTaskFactory$StandardTaskAction.execute(AnnotationProcessingTaskFactory.java:200)
 at org.gradle.api.internal.tasks.execution.ExecuteActionsTaskExecuter.executeAction(ExecuteActionsTaskExecuter.java:80)
FAILURE: Build failed with an exception.
* What went wrong:
Execution failed for task ':compileJava'.
> Compilation failed; see the compiler error output for details.
* Try:
Run with --stacktrace option to get the stack trace. Run with --info or --debug option to get more log output.
BUILD FAILED
Total time: 19.603 secs
C:\Users\karri_000\Desktop\forge>
Task completed with return code 0 in 20293 milliseconds
  
Executing gradle command: clean runClient
Microsoft Windows [Version 6.3.9600]
(c) 2013 Microsoft Corporation. All rights reserved.
C:\Users\karri_000\Desktop>cd forge
C:\Users\karri_000\Desktop\forge>SET "JAVA_HOME=C:\Users\karri_000\Desktop\jdk\"
C:\Users\karri_000\Desktop\forge>SET JAVA_EXE=%JAVA_HOME%\bin\java.exe
C:\Users\karri_000\Desktop\forge>SET PATH=%JAVA_HOME%\bin\;%PATH%
C:\Users\karri_000\Desktop\forge>SET "JAVA_OPTS=-Xmx256m -Xms256m"
C:\Users\karri_000\Desktop\forge>gradlew clean runClient
****************************
 Powered By MCP:            
 http://modcoderpack.com/   
 Searge, ProfMobius, Fesh0r,
 R4wk, ZeuX, IngisKahn, bspkrs
 MCP Data version : snapshot_20141130
****************************
:clean
:downloadClient SKIPPED
:downloadServer SKIPPED
:getVersionJson
:extractUserDev UP-TO-DATE
:mergeJars SKIPPED
:applyBinPatches SKIPPED
:downloadMcpTools SKIPPED
:extractMcpData UP-TO-DATE
:genSrgs SKIPPED
:deobfBinJar SKIPPED
:compileApiJava UP-TO-DATE
:processApiResources UP-TO-DATE
:apiClasses UP-TO-DATE
:sourceMainJava
The system is out of resources.
Consult the following stack trace for details.
java.lang.OutOfMemoryError: Java heap space
 at com.sun.tools.javac.util.Position$LineMapImpl.build(Position.java:153)
 at com.sun.tools.javac.util.Position.makeLineMap(Position.java:77)
 at com.sun.tools.javac.parser.Scanner.getLineMap(Scanner.java:1147)
 at com.sun.tools.javac.parser.JavacParser.parseCompilationUnit(JavacParser.java:2310)
 at com.sun.tools.javac.main.JavaCompiler.parse(JavaCompiler.java:595)
 at com.sun.tools.javac.main.JavaCompiler.parse(JavaCompiler.java:632)
 at com.sun.tools.javac.main.JavaCompiler.parseFiles(JavaCompiler.java:909)
 at com.sun.tools.javac.main.JavaCompiler.compile(JavaCompiler.java:824)
 at com.sun.tools.javac.main.Main.compile(Main.java:439)
 at com.sun.tools.javac.api.JavacTaskImpl.call(JavacTaskImpl.java:132)
 at org.gradle.api.internal.tasks.compile.jdk6.Jdk6JavaCompiler.execute(Jdk6JavaCompiler.java:45)
 at org.gradle.api.internal.tasks.compile.jdk6.Jdk6JavaCompiler.execute(Jdk6JavaCompiler.java:38)
 at org.gradle.api.internal.tasks.compile.NormalizingJavaCompiler.delegateAndHandleErrors(NormalizingJavaCompiler.java:96)
 at org.gradle.api.internal.tasks.compile.NormalizingJavaCompiler.execute(NormalizingJavaCompiler.java:49)
 at org.gradle.api.internal.tasks.compile.NormalizingJavaCompiler.execute(NormalizingJavaCompiler.java:35)
 at org.gradle.api.internal.tasks.compile.DelegatingJavaCompiler.execute(DelegatingJavaCompiler.java:29)
 at org.gradle.api.internal.tasks.compile.DelegatingJavaCompiler.execute(DelegatingJavaCompiler.java:20)
 at org.gradle.api.internal.tasks.compile.CleaningJavaCompilerSupport.execute(CleaningJavaCompilerSupport.java:33)
 at org.gradle.api.internal.tasks.compile.CleaningJavaCompilerSupport.execute(CleaningJavaCompilerSupport.java:24)
 at org.gradle.api.tasks.compile.JavaCompile.performCompilation(JavaCompile.java:87)
 at org.gradle.api.tasks.compile.JavaCompile.compile(JavaCompile.java:65)
 at org.gradle.api.tasks.compile.JavaCompile.compile(JavaCompile.java:53)
 at sun.reflect.NativeMethodAccessorImpl.invoke0(Native Method)
 at sun.reflect.NativeMethodAccessorImpl.invoke(NativeMethodAccessorImpl.java:57)
 at sun.reflect.DelegatingMethodAccessorImpl.invoke(DelegatingMethodAccessorImpl.java:43)
 at java.lang.reflect.Method.invoke(Method.java:606)
 at org.gradle.internal.reflect.JavaMethod.invoke(JavaMethod.java:63)
:compileJava FAILED
 at org.gradle.api.internal.project.taskfactory.AnnotationProcessingTaskFactory$IncrementalTaskAction.doExecute(AnnotationProcessingTaskFactory.java:235)
 at org.gradle.api.internal.project.taskfactory.AnnotationProcessingTaskFactory$StandardTaskAction.execute(AnnotationProcessingTaskFactory.java:211)
 at org.gradle.api.internal.project.taskfactory.AnnotationProcessingTaskFactory$IncrementalTaskAction.execute(AnnotationProcessingTaskFactory.java:222)
 at org.gradle.api.internal.project.taskfactory.AnnotationProcessingTaskFactory$StandardTaskAction.execute(AnnotationProcessingTaskFactory.java:200)
 at org.gradle.api.internal.tasks.execution.ExecuteActionsTaskExecuter.executeAction(ExecuteActionsTaskExecuter.java:80)
FAILURE: Build failed with an exception.
* What went wrong:
Execution failed for task ':compileJava'.
> Compilation failed; see the compiler error output for details.
* Try:
Run with --stacktrace option to get the stack trace. Run with --info or --debug option to get more log output.
BUILD FAILED
Total time: 18.603 secs
C:\Users\karri_000\Desktop\forge>
Task completed with return code 0 in 19274 milliseconds

 

Offline
Last seen: 1 month 4 weeks ago
Joined: 11/26/2015 - 16:27
Gems: 0
and it also pulls up the

and it also pulls up the problematic mods and says there are mods causing problems and where it should say the problem mods it doesnt have anything