Whenever I try to launch the client...

2 posts / 0 new
Last post
Offline
Last seen: 1 year 10 months ago
Joined: 01/10/2015 - 01:06
Gems: 0
Whenever I try to launch the client...

This comes up.

>BOOTING UP GRADLE...
>Data loaded, MCreator gradle console ready [ver 1.007]! [boot took 52 milliseconds]
>RIGHT click once to copy log to the clipboard or twice to clear the log.
>===================================================================================================================
>Executing gradle command: runClient
>Microsoft Windows [Version 6.1.7601]
>Copyright (c) 2009 Microsoft Corporation.  All rights reserved.
>C:\Pylo\MCreator154>cd forge
>C:\Pylo\MCreator154\forge>SET "JAVA_HOME=C:\Pylo\MCreator154\jdk\"
>C:\Pylo\MCreator154\forge>SET JAVA_EXE=%JAVA_HOME%\bin\java.exe
>C:\Pylo\MCreator154\forge>SET PATH=%JAVA_HOME%\bin\;%PATH%
>C:\Pylo\MCreator154\forge>gradlew runClient
>****************************
> Powered By MCP:             
> Searge, ProfMobius, Fesh0r, 
> R4wk, ZeuX, IngisKahn, bspkrs
> MCP Data version : unknown
>****************************
>:compileApiJava UP-TO-DATE
>:processApiResources UP-TO-DATE
>:apiClasses UP-TO-DATE
>:sourceMainJava UP-TO-DATE
>C:\Pylo\MCreator154\forge\build\sources\java\mod\mcreator\TestEnvironmentMod.java:110: error: cannot find symbol
>mcreator_slimeLand mcreator_2 = new mcreator_slimeLand();
>^
>  symbol:   class mcreator_slimeLand
>  location: class TestEnvironmentMod
>C:\Pylo\MCreator154\forge\build\sources\java\mod\mcreator\TestEnvironmentMod.java:111: error: cannot find symbol
>mcreator_eSlime mcreator_3 = new mcreator_eSlime();
>^
>  symbol:   class mcreator_eSlime
>  location: class TestEnvironmentMod
>C:\Pylo\MCreator154\forge\build\sources\java\mod\mcreator\TestEnvironmentMod.java:112: error: cannot find symbol
>mcreator_slimian mcreator_4 = new mcreator_slimian();
>^
>  symbol:   class mcreator_slimian
>  location: class TestEnvironmentMod
>C:\Pylo\MCreator154\forge\build\sources\java\mod\mcreator\TestEnvironmentMod.java:110: error: cannot find symbol
>mcreator_slimeLand mcreator_2 = new mcreator_slimeLand();
>                                    ^
>  symbol:   class mcreator_slimeLand
>  location: class TestEnvironmentMod
>C:\Pylo\MCreator154\forge\build\sources\java\mod\mcreator\TestEnvironmentMod.java:111: error: cannot find symbol
>mcreator_eSlime mcreator_3 = new mcreator_eSlime();
>                                 ^
>  symbol:   class mcreator_eSlime
>  location: class TestEnvironmentMod
>C:\Pylo\MCreator154\forge\build\sources\java\mod\mcreator\TestEnvironmentMod.java:112: error: cannot find symbol
>mcreator_slimian mcreator_4 = new mcreator_slimian();
>                                  ^
>  symbol:   class mcreator_slimian
>  location: class TestEnvironmentMod
>6 errors
>:compileJava FAILED
>FAILURE: Build failed with an exception.
>* What went wrong:
>Execution failed for task ':compileJava'.
>> Compilation failed; see the compiler error output for details.
>BUILD FAILED
>* Try:
>Total time: 44.76 secs
>Run with --stacktrace option to get the stack trace. Run with --info or --debug option to get more log output.
>C:\Pylo\MCreator154\forge>
>Task completed with return code 0 in 45904 milliseconds
 


Wes
Wes's picture
Offline
Last seen: 7 months 3 weeks ago
Joined: 04/26/2014 - 16:35
Gems: 3
What Did you tried to make ?

What Did you tried to make ?

 

Eye for secrets