Exporting Not Working

9 posts / 0 new
Last post
Offline
Last seen: 2 years 5 months ago
Joined: 07/21/2014 - 16:42
Gems: 0
Exporting Not Working

Help! Everytime I export my mod I get this:C:\Users\Owner\Downloads\MCreator 1.5.2 [1.7.10]\forge\build\sources\java\mcreator_nightmare.java:151: error: EntityAIDoorInteract is abstract; cannot be instantiated

this.tasks.addTask(1, new EntityAIDoorInteract(this));
                      ^
C:\Users\Owner\Downloads\MCreator 1.5.2 [1.7.10]\forge\build\sources\java\mcreator_nightmare.java:226: error: cannot find symbol
setResistance(5.0F);
^
  symbol:   method setResistance(float)
  location: class Entitynightmare
2 errors
 
FAILURE: Build failed with an exception.
 
* What went wrong:
Execution failed for task ':compileJava'.
> Compilation failed; see the compiler error output for details.
 
* Try:
Run with --stacktrace option to get the stack trace. Run with --info or --debug option to get more log output.
 


Offline
Last seen: 1 year 1 month ago
Joined: 09/28/2014 - 10:37
Gems: -1
I know what the problem is.

I know what the problem is. Giving mobs the ability to open and close doors doesn't work. Hopefully, this will be fixed in the future. In the meantime, don't give mobs the AI task that allows them to open or close doors, or they won't compile correctly.

Offline
Last seen: 2 years 4 months ago
Joined: 12/27/2014 - 23:56
Gems: 0
RE:I know what the problem is.

@Olorin2 I am not using those AI tasks and yet I still have the same problem over and over again!

compileJava FAILED
>FAILURE: Build failed with an exception.
>* What went wrong:
>Execution failed for task ':compileJava'.

Offline
Last seen: 4 months 2 days ago
Joined: 11/04/2014 - 10:21
Gems: 3
RE:I know what the problem is.

@Olorin2 how about this >BOOTING UP GRADLE...
>Data loaded, MCreator gradle console ready [ver 1.007]! [boot took 0 milliseconds]
>RIGHT click once to copy log to the clipboard or twice to clear the log.
>===================================================================================================================
>Executing gradle command: build
>Microsoft Windows [Version 6.1.7601]
>Copyright (c) 2009 Microsoft Corporation. All rights reserved.
>C:\Users\jayjay\Desktop>cd forge
>C:\Users\jayjay\Desktop\forge>SET "JAVA_HOME=C:\Users\jayjay\Desktop\jdk\"
>C:\Users\jayjay\Desktop\forge>SET JAVA_EXE=%JAVA_HOME%\bin\java.exe
>C:\Users\jayjay\Desktop\forge>SET PATH=%JAVA_HOME%\bin\;%PATH%
>C:\Users\jayjay\Desktop\forge>gradlew build
>****************************
> Powered By MCP:
> http://mcp.ocean-labs.de/
> Searge, ProfMobius, Fesh0r,
> R4wk, ZeuX, IngisKahn, bspkrs
> MCP Data version : unknown
>****************************
>:compileApiJava UP-TO-DATE
>:processApiResources UP-TO-DATE
>:apiClasses UP-TO-DATE
>:sourceMainJava
>C:\Users\jayjay\Desktop\forge\build\sources\java\mod\mcreator\ModName.java:109: error: cannot find symbol
>mcreator_wonderFulForestDimension mcreator_1 = new mcreator_wonderFulForestDimension();
>^
> symbol: class mcreator_wonderFulForestDimension
> location: class ModName
>C:\Users\jayjay\Desktop\forge\build\sources\java\mod\mcreator\ModName.java:110: error: cannot find symbol
>mcreator_tropicalPinaple mcreator_2 = new mcreator_tropicalPinaple();
>^
> symbol: class mcreator_tropicalPinaple
> location: class ModName
>C:\Users\jayjay\Desktop\forge\build\sources\java\mod\mcreator\ModName.java:111: error: cannot find symbol
>mcreator_log mcreator_3 = new mcreator_log();
>^
> symbol: class mcreator_log
> location: class ModName
>C:\Users\jayjay\Desktop\forge\build\sources\java\mod\mcreator\ModName.java:112: error: cannot find symbol
>mcreator_tropical mcreator_4 = new mcreator_tropical();
>^
> symbol: class mcreator_tropical
> location: class ModName
>C:\Users\jayjay\Desktop\forge\build\sources\java\mod\mcreator\ModName.java:109: error: cannot find symbol
>mcreator_wonderFulForestDimension mcreator_1 = new mcreator_wonderFulForestDimension();
> ^
> symbol: class mcreator_wonderFulForestDimension
> location: class ModName
>C:\Users\jayjay\Desktop\forge\build\sources\java\mod\mcreator\ModName.java:110: error: cannot find symbol
>mcreator_tropicalPinaple mcreator_2 = new mcreator_tropicalPinaple();
> ^
> symbol: class mcreator_tropicalPinaple
> location: class ModName
>C:\Users\jayjay\Desktop\forge\build\sources\java\mod\mcreator\ModName.java:111: error: cannot find symbol
>mcreator_log mcreator_3 = new mcreator_log();
> ^
> symbol: class mcreator_log
> location: class ModName
>C:\Users\jayjay\Desktop\forge\build\sources\java\mod\mcreator\ModName.java:112: error: cannot find symbol
>mcreator_tropical mcreator_4 = new mcreator_tropical();
> ^
> symbol: class mcreator_tropical
> location: class ModName
>8 errors
>:compileJava FAILED
>FAILURE: Build failed with an exception.
>* What went wrong:
>Execution failed for task ':compileJava'.
>BUILD FAILED
>> Compilation failed; see the compiler error output for details.
>* Try:
>Run with --stacktrace option to get the stack trace. Run with --info or --debug option to get more log output.
>Total time: 7.785 secs
>C:\Users\jayjay\Desktop\forge>
>Task completed with return code 0 in 8377 milliseconds

could you help me with that?

Offline
Last seen: 4 months 2 days ago
Joined: 11/04/2014 - 10:21
Gems: 3
haha i have the SAME problem

haha i have the SAME problem over and over and OVER again with the export. look at this MASSIVE error >:/ \/\/\/\/
>:compileApiJava UP-TO-DATE
>:processApiResources UP-TO-DATE
>:apiClasses UP-TO-DATE
>:sourceMainJava
>C:\Users\jayjay\Desktop\forge\build\sources\java\mod\mcreator\ModName.java:109: error: cannot find symbol
>mcreator_wonderFulForestDimension mcreator_1 = new mcreator_wonderFulForestDimension();
>^
> symbol: class mcreator_wonderFulForestDimension
> location: class ModName
>C:\Users\jayjay\Desktop\forge\build\sources\java\mod\mcreator\ModName.java:110: error: cannot find symbol
>mcreator_tropicalPinaple mcreator_2 = new mcreator_tropicalPinaple();
>^
> symbol: class mcreator_tropicalPinaple
> location: class ModName
>C:\Users\jayjay\Desktop\forge\build\sources\java\mod\mcreator\ModName.java:111: error: cannot find symbol
>mcreator_log mcreator_3 = new mcreator_log();
>^
> symbol: class mcreator_log
> location: class ModName
>C:\Users\jayjay\Desktop\forge\build\sources\java\mod\mcreator\ModName.java:112: error: cannot find symbol
>mcreator_tropical mcreator_4 = new mcreator_tropical();
>^
> symbol: class mcreator_tropical
> location: class ModName
>C:\Users\jayjay\Desktop\forge\build\sources\java\mod\mcreator\ModName.java:109: error: cannot find symbol
>mcreator_wonderFulForestDimension mcreator_1 = new mcreator_wonderFulForestDimension();
> ^
> symbol: class mcreator_wonderFulForestDimension
> location: class ModName
>C:\Users\jayjay\Desktop\forge\build\sources\java\mod\mcreator\ModName.java:110: error: cannot find symbol
>mcreator_tropicalPinaple mcreator_2 = new mcreator_tropicalPinaple();
> ^
> symbol: class mcreator_tropicalPinaple
> location: class ModName
>C:\Users\jayjay\Desktop\forge\build\sources\java\mod\mcreator\ModName.java:111: error: cannot find symbol
>mcreator_log mcreator_3 = new mcreator_log();
> ^
> symbol: class mcreator_log
> location: class ModName
>C:\Users\jayjay\Desktop\forge\build\sources\java\mod\mcreator\ModName.java:112: error: cannot find symbol
>mcreator_tropical mcreator_4 = new mcreator_tropical();
> ^
> symbol: class mcreator_tropical
> location: class ModName
>8 errors
>:compileJava FAILED
>FAILURE: Build failed with an exception.
>* What went wrong:
>Execution failed for task ':compileJava'.
>BUILD FAILED
>> Compilation failed; see the compiler error output for details.
>* Try:
>Run with --stacktrace option to get the stack trace. Run with --info or --debug option to get more log output.
>Total time: 7.785 secs
>C:\Users\jayjay\Desktop\forge>
>Task completed with return code 0 in 8377 milliseconds

Offline
Last seen: 4 months 2 days ago
Joined: 11/04/2014 - 10:21
Gems: 3
GRRRR

GRRRR

Offline
Last seen: 1 year 10 months ago
Joined: 01/15/2015 - 14:26
Gems: 0
Mine says error: cannot find

Mine says error: cannot find symbol as well. :(

Offline
Last seen: 1 year 10 months ago
Joined: 07/17/2015 - 05:26
Gems: 0
da fuq  

da fuq

 

BlackGhosts070's picture
Offline
Last seen: 1 year 5 months ago
Joined: 10/20/2014 - 17:30
Gems: 0
did you use a custom code or

did you use a custom code or did you change anything in the source code?